program: Gaussian 09
title: 000207864
version: EM64L-G09RevD.01
frameworkgroup: C1[X(C11H18NO5PS2)]
method: RPBEPBE
basis: SDD
operation: Freq
keyword: #p
keyword: freq=noraman
keyword: PBEPBE/SDD
title: #p freq=noraman PBEPBE/SDD
converged: NO YES NO NO
title: Mulliken charges:
elementType: S S P O O O O O N C C C C C C C C C C C H H H H H H H H H H H H H H H H H H
charge: 0.911474 -0.207385 0.872090 -0.496015 -0.535903 -0.539671 -0.468309 -0.458155 -0.470208 -0.395553 -0.024895 -0.369429 -0.199409 -0.231473 0.377604 -0.340211 -0.293155 -0.662968 -0.475107 -0.476427 0.244239 0.264358 0.302759 0.196833 0.207599 0.279122 0.288659 0.264684 0.282996 0.228714 0.212223 0.235613 0.250015 0.240381 0.249434 0.248853 0.242371 0.244251
chargesum: 0.00000
title: Mulliken charges with hydrogens summed into heavy atoms:
elementType: S S P O O O O O N C C C C C C C C C C C
charge: 0.911474 -0.207385 0.872090 -0.496015 -0.535903 -0.539671 -0.468309 -0.458155 -0.167449 0.113045 -0.024895 0.035004 0.079713 0.057186 0.377604 -0.075527 -0.010160 0.013582 0.264723 0.259049
polarizability: 3.02314167e+02 -1.98384868e+00 1.89082353e+02 5.40207459e+00 4.02198149e+00 1.70424294e+02
1716.lowfreq: -13.7924 -11.2426 -4.3991 -0.0020 -0.0013 -0.0012 6.6917 16.4703 22.4081
frequency: -10.0260 13.9664 22.2644 39.7749 43.3161 49.8623 52.7737 74.2049 84.8514 92.9688 101.5341 118.5314 127.6687 131.4255 146.1152 166.1644 198.4673 210.3349 223.7772 231.6137 251.1805 255.4460 265.9748 301.1022 309.7703 319.6004 345.4150 361.9245 376.5422 410.2253 413.1831 426.6040 447.3384 482.3869 497.6525 522.8988 577.1841 617.9023 686.4975 689.1368 696.6232 717.2413 767.4666 778.1133 797.0082 828.7927 832.2598 840.0106 849.8510 890.9598 935.9547 954.4982 961.3458 968.7275 971.2618 975.8734 993.1780 1050.5385 1084.7073 1091.3001 1106.7566 1112.0785 1113.8378 1115.4431 1131.2460 1131.8443 1163.8150 1192.7454 1225.4607 1264.2994 1285.8700 1303.8058 1344.6524 1367.8468 1385.6772 1400.9792 1403.9061 1421.7088 1423.1825 1446.0823 1456.1020 1459.4447 1463.2263 1463.7723 1468.7057 1469.5240 1478.0868 1494.8522 1585.8706 1599.2227 2965.3990 2979.3381 2980.9564 2987.0955 2988.3297 3018.5274 3038.6773 3074.0932 3083.5161 3093.5411 3095.9752 3135.8890 3138.5498 3155.3216 3161.6676 3171.8023 3183.1556 3351.7769
redmass: 4.9745 5.1236 4.0907 3.7595 4.3531 3.6073 5.0667 3.7066 3.2047 1.1767 2.3751 5.3074 1.3773 3.0644 4.5920 4.8043 6.5325 3.9224 4.4044 1.7037 7.1863 4.7866 5.7377 3.8097 5.1686 2.9062 6.4293 5.1520 5.5736 7.5602 2.9606 7.4674 2.8389 7.6316 3.6240 3.6164 7.6426 7.3133 10.0607 9.2531 12.1134 3.9042 1.1909 2.2502 11.6190 1.7612 2.7527 2.3501 1.5475 1.5759 4.5662 11.2180 1.3581 10.6135 2.0151 1.4032 5.0522 2.4164 2.8677 1.8584 1.3147 1.2445 1.2423 1.5163 1.3023 1.3003 1.3804 2.6004 1.2726 1.1732 1.2491 1.1920 1.4157 1.2447 6.8731 3.7053 1.1989 1.1228 1.1191 1.0676 1.0537 1.0510 2.1688 1.0895 1.0586 1.0520 1.0481 1.0496 6.1807 8.1015 1.0605 1.0437 1.0548 1.0302 1.0304 1.0988 1.1019 1.0997 1.1003 1.1047 1.1044 1.1035 1.1039 1.0889 1.0894 1.0972 1.0972 1.0743
irintensity: 0.8438 0.3532 0.7442 2.2593 0.3547 3.1477 0.6581 6.8766 1.2395 0.8075 0.6415 5.0515 1.0569 4.7044 2.5420 4.8390 0.7740 0.9646 17.4266 8.8258 24.1442 10.8199 2.8938 2.1704 2.4862 3.7816 4.9066 16.1439 16.0658 13.2304 0.7787 28.0791 80.6800 7.2740 73.6993 77.6755 90.0749 2.1087 135.1931 73.2282 152.0133 10.1288 41.0180 116.8706 54.9632 89.4458 167.3430 22.1320 60.8975 16.6793 68.9106 228.1583 1.6748 173.1388 11.6054 1.5553 4.9083 31.1852 15.4224 1.1250 11.0690 0.0710 0.8788 12.0838 1.4535 0.2952 144.7384 194.3927 6.0761 1.7832 2.9450 4.6147 9.1788 6.8332 3.9778 12.0251 16.0125 2.1177 6.3205 16.1068 10.4737 14.5920 140.2190 9.0523 17.6781 17.0912 21.6441 23.1147 79.2213 4.8811 36.3707 39.0061 9.6660 47.1379 40.2130 33.4781 6.6444 36.8845 36.3695 21.1466 20.7761 12.9292 9.7258 0.8437 0.3536 2.5876 4.0692 11.3855
temp: 298.150 k
press: 1.00000 atm
elementType: 16 16 15 8 8 8 8 8 7 6 6 6 6 6 6 6 6 6 6 6 1 1 1 1 1 1 1 1 1 1 1 1 1 1 1 1 1 1
symmnumber: 1
zpe: 745016.0 jmol-1
zpe.correction: 0.283762 hartree
zpe.thermalcorrener: 0.307862 hartree
zpe.thermalcorrenthalpy: 0.308806 hartree
zpe.thermalcorrgfe: 0.226656 hartree
zpe.sumelectzpe: -1996.433905 hartree
zpe.sumelectthermal: -1996.409804 hartree
zpe.sumelectthermalent: -1996.408860 hartree
zpe.sumelectthermalfe: -1996.491010 hartree
dipole: -4.4065 -1.6999 2.9116
dipole: 5.5483
quadrupole: -121.6861 -130.6678 -153.1785
quadrupole: -8.6111 14.8130 5.7828
quadrupole: 13.4914 4.5097 -18.0010 -8.6111 14.8130 5.7828
hfenergy: -1996.7176661 hartree
pointgroup: C01 [X(C11H18N1O5P1S2)]
dipole: 1.8061723 -1.1170293 -0.5049639 debye
polarizability: 301.2519535|11.3459051|179.8470752|6.5419723|-9.6926026|180.7217862 unknown
InChI: InChI=1S/C11H18NO5PS2/c1-4-9-12-20(13,14)11-7-5-10(6-8-11)17-18(19,15-2)16-3/h5-8,12H,4,9H2,1-3H3
charge 0 multiplicity 1
38 atoms
S  -3.093531 0.187713 0.066185
S  3.980279 -1.534933 -1.625491
P  4.131532 -0.126084 -0.134137
O  2.869153 -0.049048 1.071059
O  -3.826436 0.072574 1.518443
O  -3.363363 1.439027 -0.952196
O  4.185059 1.535743 -0.577259
O  5.489098 -0.204968 0.917155
N  -3.423915 -1.45201 -0.813277
C  -4.663576 -2.143925 -0.355015
C  -1.237293 0.100626 0.343583
C  -5.959921 -1.7997 -1.124007
C  -0.758696 -0.645151 1.434041
C  -0.4060 0.812925 -0.534915
C  1.490583 0.003495 0.758326
C  0.63437 -0.697354 1.638585
C  0.987629 0.768532 -0.319283
C  -6.455693 -0.351591 -0.916449
C  5.197253 1.956335 -1.580258
C  5.947139 -1.529489 1.401979
H  -4.440996 -3.226204 -0.436374
H  -4.781916 -1.913661 0.722245
H  -3.451673 -1.193068 -1.819872
H  -5.80829 -1.999578 -2.205456
H  -6.742268 -2.509233 -0.786744
H  -1.451592 -1.157812 2.10782
H  -0.840533 1.410169 -1.342678
H  1.067197 -1.265231 2.46645
H  1.670825 1.335466 -0.958889
H  -6.625615 -0.143649 0.155502
H  -7.406254 -0.184931 -1.454899
H  -5.727497 0.3951 -1.284206
H  4.918352 2.988282 -1.837108
H  5.152875 1.310042 -2.476155
H  6.204105 1.928545 -1.130921
H  6.948311 -1.341149 1.815749
H  6.002699 -2.255155 0.569901
H  5.268199 -1.89705 2.190168
