program: Gaussian 09
title: 000207862
version: EM64L-G09RevD.01
frameworkgroup: C1[X(C12H20NO5PS2)]
method: RPBEPBE
basis: SDD
operation: Freq
keyword: #p
keyword: freq=noraman
keyword: PBEPBE/SDD
title: #p freq=noraman PBEPBE/SDD
converged: NO YES NO NO
title: Mulliken charges:
elementType: S S P O O O O O N C C C C C C C C C C C C H H H H H H H H H H H H H H H H H H H H
charge: 1.005119 -0.206233 0.874371 -0.503647 -0.474865 -0.477292 -0.558767 -0.539796 -0.241986 -0.254912 0.421337 -0.224619 -0.286291 -0.600513 -0.610677 -0.236532 -0.186628 -0.213780 -0.262459 -0.653434 -0.649560 0.300683 0.272700 0.239906 0.282577 0.224390 0.247313 0.213050 0.278035 0.244087 0.238108 0.232267 0.225455 0.227526 0.291390 0.212577 0.237115 0.229858 0.220969 0.220093 0.243064
chargesum: 0.00000
title: Mulliken charges with hydrogens summed into heavy atoms:
elementType: S S P O O O O O N C C C C C C C C C C C C
charge: 1.005119 -0.206233 0.874371 -0.503647 -0.474865 -0.477292 -0.558767 -0.539796 -0.241986 -0.254912 0.421337 0.076064 -0.013591 0.146360 0.127721 0.007555 0.051480 0.243943 0.256456 0.026116 0.034566
polarizability: 2.55790992e+02 7.33488208e+00 2.39542334e+02 -3.37583510e+00 -1.45795272e+01 1.90899175e+02
1716.lowfreq: -18.4547 -15.1013 -7.9731 -6.3914 0.0004 0.0018 0.0023 12.5107 23.4114
frequency: -17.6072 9.6134 23.0731 33.1966 40.1390 46.0928 54.2680 68.5050 70.7294 82.9470 90.9478 120.5959 131.6352 158.1201 173.0581 183.2164 192.2329 211.5131 217.0796 222.2332 224.8990 235.5044 242.1615 249.2539 274.4020 283.8452 296.0725 306.2704 334.6232 373.2640 377.7236 389.9324 416.5176 423.6623 446.7658 459.3689 473.3254 503.3777 533.6874 559.9419 622.2405 656.1571 681.3381 705.5885 717.1301 774.7463 789.7645 810.6256 810.9549 834.7679 853.0930 854.4299 877.5431 880.7270 948.0128 965.9775 991.6990 996.4071 998.3136 1013.1646 1019.6790 1030.2234 1077.8525 1092.3524 1106.2357 1109.0312 1116.2996 1133.0580 1141.3699 1167.1049 1168.8486 1197.2237 1205.8321 1250.7215 1254.1402 1266.1810 1353.6028 1356.8503 1377.9632 1388.6627 1395.5454 1405.7909 1419.0335 1424.2051 1445.2652 1452.4655 1454.7271 1458.3736 1458.5707 1468.5335 1470.7425 1473.6756 1477.1346 1483.8654 1486.7951 1570.4239 1595.1657 2923.2699 2950.1429 2987.7176 2988.5477 2997.0182 3025.7288 3043.2269 3046.4321 3056.5385 3082.9401 3086.8884 3093.6012 3102.1418 3111.5387 3112.7925 3114.7362 3141.4794 3149.8803 3161.1044 3175.0302
redmass: 3.5558 4.8871 3.3761 3.9493 2.2993 2.6398 3.5950 4.1418 4.6957 4.4454 5.1878 4.4976 3.9842 4.8807 6.5166 3.6742 2.1316 2.2767 2.6853 1.4969 1.2848 1.6641 2.7337 3.9691 3.6248 3.4503 5.0982 4.7626 5.8679 4.4649 3.7381 4.9153 4.8657 4.6617 6.1370 6.2953 5.6620 6.8223 6.5160 4.9128 7.7753 9.2179 6.7120 6.6912 3.9879 1.2834 1.1392 12.9613 1.1078 7.6505 4.7186 4.3318 4.0519 1.3996 13.9159 1.3736 4.6244 1.4738 2.4438 1.4476 2.5593 2.0386 1.2289 2.2415 2.2281 1.3727 1.6283 1.4179 1.5415 1.7915 1.7894 2.8002 1.7292 1.5042 1.1490 1.1108 1.2524 1.2093 6.9476 1.2379 1.2426 1.1287 1.1337 2.3311 2.2457 1.0493 1.0878 1.0401 1.0431 1.0480 1.0676 1.0566 1.0569 1.0587 1.0774 6.3149 7.2610 1.0457 1.0401 1.0378 1.0533 1.0379 1.0600 1.0880 1.0954 1.1075 1.0980 1.1036 1.0982 1.0987 1.1023 1.1059 1.0971 1.0861 1.0900 1.0949 1.1008
irintensity: 0.8672 0.8713 1.8885 0.5473 0.2176 3.9995 2.0446 2.4541 2.9985 0.4219 3.8270 1.3989 4.3570 1.2369 4.3967 0.6531 0.2891 2.0082 1.9814 1.8508 1.2250 1.8885 5.4540 3.1692 9.7332 19.4525 3.9617 4.5750 0.5124 3.6939 6.4105 7.7275 6.0264 39.8302 68.5882 23.4007 24.6781 78.3592 11.7019 4.0551 48.9128 102.4536 68.7660 83.3195 17.3107 87.1776 8.7366 72.7212 2.0788 181.3683 134.4842 62.9134 142.6840 5.3573 86.3543 1.0446 13.7205 5.4219 100.9477 0.5013 127.3769 9.6558 0.1497 8.7720 14.1624 20.1403 15.8627 4.1803 12.6801 1.4919 15.6057 112.5041 10.0002 24.5991 0.5642 2.0013 11.5898 7.0689 8.9362 32.2647 28.4503 21.1668 2.1122 5.1101 85.7289 24.0753 20.1609 9.7039 15.4097 8.6557 7.9474 47.4925 10.0539 11.8731 8.7228 6.8937 25.8069 56.5419 43.3744 9.9575 39.0791 23.9280 11.3629 13.4625 30.9454 10.3997 24.9603 3.2745 27.1716 2.2040 28.2616 23.1450 3.0826 5.2490 4.6229 2.8491 19.9623
temp: 298.150 k
press: 1.00000 atm
elementType: 16 16 15 8 8 8 8 8 7 6 6 6 6 6 6 6 6 6 6 6 6 1 1 1 1 1 1 1 1 1 1 1 1 1 1 1 1 1 1 1 1
symmnumber: 1
zpe: 815977.5 jmol-1
zpe.correction: 0.310789 hartree
zpe.thermalcorrener: 0.336337 hartree
zpe.thermalcorrenthalpy: 0.337281 hartree
zpe.thermalcorrgfe: 0.252214 hartree
zpe.sumelectzpe: -2035.659689 hartree
zpe.sumelectthermal: -2035.634142 hartree
zpe.sumelectthermalent: -2035.633197 hartree
zpe.sumelectthermalfe: -2035.718265 hartree
dipole: -2.6363 3.1797 4.2923
dipole: 5.9569
quadrupole: -136.5948 -134.7156 -152.1180
quadrupole: 12.8001 7.1886 -4.3654
quadrupole: 4.5480 6.4272 -10.9752 12.8001 7.1886 -4.3654
hfenergy: -2035.9704788 hartree
pointgroup: C01 [X(C12H20N1O5P1S2)]
dipole: -0.8352395 1.4667734 1.6258847 debye
polarizability: 256.3746667|4.4285841|235.9105775|-8.2459364|-17.8192425|193.9472578 unknown
InChI: InChI=1S/C12H20NO5PS2/c1-5-16-19(20,17-6-2)18-11-9-7-8-10-12(11)21(14,15)13(3)4/h7-10H,5-6H2,1-4H3
charge 0 multiplicity 1
41 atoms
S  2.233163 -1.271403 -0.341516
S  -2.230878 0.423272 -1.991679
P  -1.923354 0.050318 0.008833
O  -0.290789 0.295285 0.648886
O  -2.719146 1.058384 1.157147
O  -2.283037 -1.490437 0.662281
O  0.908804 -2.102899 -0.776781
O  3.637544 -1.441328 -1.143041
N  2.630455 -1.804523 1.427686
C  1.86895 0.611897 -0.417463
C  0.637576 1.141449 0.020098
C  2.876324 1.420526 -0.970147
C  0.405193 2.530417 -0.109428
C  1.447951 -1.747691 2.318879
C  3.837031 -1.100753 1.92099
C  2.63926 2.80825 -1.094108
C  1.405984 3.355064 -0.66663
C  -4.215761 1.114895 1.110582
C  -2.0663 -2.735911 -0.166451
C  -4.628479 2.185464 2.114856
C  -3.349561 -3.121326 -0.898966
H  3.805502 0.954018 -1.314885
H  -0.550458 2.940494 0.23363
H  1.661207 -2.415932 3.173756
H  0.567489 -2.136528 1.784821
H  1.215832 -0.730572 2.698375
H  4.202286 -1.66527 2.798023
H  3.651296 -0.047863 2.230492
H  4.617356 -1.135741 1.143378
H  3.40873 3.453493 -1.529175
H  1.221529 4.429762 -0.76767
H  -4.609043 0.118236 1.383202
H  -4.532794 1.367745 0.079981
H  -1.783854 -3.481053 0.595574
H  -1.207626 -2.579085 -0.841943
H  -5.730845 2.267193 2.13982
H  -4.273859 1.927408 3.126794
H  -4.210975 3.167459 1.835228
H  -3.198195 -4.092133 -1.407843
H  -4.191152 -3.23042 -0.192652
H  -3.613255 -2.371258 -1.663836
