program: Gaussian 09
title: 000207821
version: EM64L-G09RevD.01
frameworkgroup: C1[X(C11H12N2O)]
method: RPBEPBE
basis: SDD
operation: Freq
keyword: #p
keyword: freq=noraman
keyword: PBEPBE/SDD
title: #p freq=noraman PBEPBE/SDD
converged: YES YES NO NO
title: Mulliken charges:
elementType: O N N C C C C C C C C C C C H H H H H H H H H H H H
charge: -0.299268 -0.264562 -0.417795 0.265524 -0.452099 0.321357 -0.236580 -0.300307 -0.318159 -0.394416 0.274240 -0.242078 -0.267508 -0.605249 0.221527 0.237579 0.220409 0.237137 0.290356 0.226902 0.225654 0.227304 0.322498 0.224419 0.281088 0.222026
chargesum: 0.00000
title: Mulliken charges with hydrogens summed into heavy atoms:
elementType: O N N C C C C C C C C C C C
charge: -0.299268 -0.264562 -0.095297 0.265524 0.007008 0.321357 -0.016171 -0.063170 -0.027803 -0.167514 0.274240 -0.016424 -0.040204 0.122284
polarizability: 1.93959878e+02 -1.66358314e+01 1.55201276e+02 -4.80677678e+00 -1.33078333e+00 6.69766120e+01
1716.lowfreq: -7.7238 0.0007 0.0008 0.0009 6.0138 9.5220 44.1563 60.5547 85.2175
frequency: 44.0676 60.5451 85.2102 122.9677 145.5516 167.3635 209.7694 271.1058 304.8821 351.4137 384.3710 388.6213 439.8469 475.3337 497.5699 514.3987 552.1739 559.2078 635.1207 697.7087 707.2924 740.1350 756.5773 764.3838 785.0262 834.4011 868.7716 934.1947 941.3846 967.4568 975.3350 980.3782 1018.0181 1043.3988 1078.7212 1117.4958 1125.9697 1135.0167 1144.0482 1177.2942 1180.4035 1223.4232 1233.4055 1246.6672 1280.8335 1298.1556 1372.2819 1386.8304 1390.0484 1421.3380 1448.0187 1453.8619 1482.7925 1488.1300 1493.0809 1516.4066 1578.4295 1604.0436 1620.9118 1678.5424 2853.3503 2974.8501 2995.7902 3052.6875 3115.5246 3120.1507 3124.3119 3136.3697 3154.7874 3161.9730 3203.2003 3576.1789
redmass: 3.7492 3.7435 1.1135 3.0620 2.8789 3.8138 4.4079 4.0858 5.1635 3.9758 3.4968 5.0461 5.4838 2.5569 1.2958 6.3469 5.4040 2.9733 5.9899 1.5422 9.7999 4.5871 1.6314 3.3576 2.1561 4.1679 1.4828 4.0699 1.3888 1.5425 1.9438 1.4065 1.7847 2.4949 3.2573 2.2913 1.2867 1.6480 2.0766 1.1698 1.2217 2.2208 1.8495 1.1662 3.4911 1.6285 1.6228 4.0896 2.0702 1.1764 2.2462 1.3433 1.5062 1.1353 1.4561 1.3420 6.8138 6.0978 7.3557 6.7370 1.0718 1.0366 1.0863 1.1016 1.0971 1.0877 1.0856 1.0897 1.1001 1.0987 1.0940 1.0771
irintensity: 5.8787 3.7719 0.5937 0.4374 1.8468 5.6085 1.6848 0.6879 1.3992 22.9397 2.6138 1.4694 2.8387 52.2380 82.9889 0.5517 5.4455 2.0326 4.2217 11.1953 14.1889 2.2565 57.8042 16.1285 55.5274 7.8722 1.7248 2.5838 3.1437 5.4638 5.4933 1.6022 13.6437 3.0518 19.5992 12.7045 5.2997 36.6111 1.8180 1.4577 1.8185 70.0511 119.6420 2.0669 394.7015 19.0402 1.6232 4.0082 1.0477 35.6623 78.4236 164.9187 27.8326 45.8867 78.7928 137.5727 2.0657 59.3741 131.0457 13.6603 96.2241 101.3603 16.8890 40.9938 1.3910 4.1853 6.9086 15.9970 30.6584 31.4652 3.0940 11.4950
temp: 298.150 k
press: 1.00000 atm
elementType: 8 7 7 6 6 6 6 6 6 6 6 6 6 6 1 1 1 1 1 1 1 1 1 1 1 1
symmnumber: 1
zpe: 549500.5 jmol-1
zpe.correction: 0.209294 hartree
zpe.thermalcorrener: 0.221687 hartree
zpe.thermalcorrenthalpy: 0.222632 hartree
zpe.thermalcorrgfe: 0.170099 hartree
zpe.sumelectzpe: -610.090418 hartree
zpe.sumelectthermal: -610.078024 hartree
zpe.sumelectthermalent: -610.077080 hartree
zpe.sumelectthermalfe: -610.129612 hartree
dipole: -1.5887 3.7020 1.9124
dipole: 4.4594
quadrupole: -66.1062 -77.1401 -87.1653
quadrupole: -5.8053 -4.8307 -2.4074
quadrupole: 10.6977 -0.3362 -10.3615 -5.8053 -4.8307 -2.4074
hfenergy: -610.2997113 hartree
pointgroup: C01[X(C11H12N2O1)]
dipole: 0.5942808 1.4515491 -0.7860817 debye
dipolederiv: -0.7751098 0.0726761 0.0311767 0.2210855 -0.8891849 0.2756456 0.0006445 0.236529 -0.4887399 -1.8900649 0.1559136 -0.0037003 0.2473693 -0.547789 0.1163046 -0.0509925 0.0361409 -0.2654206 -1.403647 -0.0884668 0.1389596 -0.2488588 -0.4398559 -0.0549829 0.1510571 -0.0723654 -0.4447653 1.174861 0.1475296 0.0003236 0.5422471 0.0088613 0.0456193 -0.0559799 0.0664749 0.0728019 0.0499822 0.1504624 -0.0264612 0.1206078 0.3411742 -0.119105 0.0101579 -0.0943864 0.4399471 -0.2990181 -0.0182459 0.019935 0.1100315 -0.0947816 -0.0076683 -0.0344723 -0.0344417 -0.0100795 0.0355035 -0.1236204 -0.0589063 -0.1047167 -0.1099908 0.057873 -0.0949408 0.0070924 -0.231173 0.0624446 0.0226445 -0.0515013 0.0117296 0.3631745 0.038186 -0.0049698 0.1067503 -0.1397105 -0.1935456 -0.0729453 -0.0009881 -0.3613971 -0.0773751 0.0165208 0.0311856 -0.0227374 -0.1511173 0.1238693 0.0439712 -0.0168818 -0.0566581 0.1241608 0.0308293 -0.0337089 0.0036888 -0.1619265 2.3759911 -0.1846204 -0.1661717 -0.4418866 1.07555 -0.4441624 -0.2712152 -0.3814815 0.496228 0.1002803 -0.0684495 -0.0165614 0.0264149 0.110713 0.0323821 0.0001384 0.0169949 -0.1529453 -0.0318516 0.1236837 -0.0045009 0.0265308 -0.1971712 0.0032067 0.0040175 -0.0136429 -0.184269 0.5785559 -0.0651283 -0.010719 -0.2996852 0.1346285 0.1309787 0.1327432 0.1166486 0.1832011 -0.0023138 -0.0786087 0.0822272 0.0268584 0.0114943 0.0155043 0.1614979 0.1345058 -0.184319 -0.0534902 -0.1147718 -0.0633744 -0.0306569 0.0503699 -0.0113683 -0.0725855 -0.0052776 0.0160112 0.0494696 -0.0363714 0.0148239 -0.00648 -0.120254 -0.0188251 0.0278363 -0.0446948 0.1677373 -0.0480991 0.1268676 0.054417 0.0413967 0.0034718 -0.0325457 0.0440445 -0.0447879 0.1437072 0.1002185 0.0707529 0.0187626 0.0592434 0.0727238 -0.0191688 0.0203983 0.001802 0.1594159 -0.0337012 0.0838842 0.0205464 0.133065 -0.0109611 -0.0279259 0.0279891 -0.0159686 0.1493714 0.0753896 -0.0266388 0.0000086 -0.0522837 -0.1251409 -0.0303227 -0.0070048 -0.0218895 0.1518945 -0.1171405 -0.0899075 0.0094306 -0.0805208 0.0538746 -0.0068466 0.0067562 -0.0024088 0.166917 0.1790569 0.032126 -0.0106061 0.0542911 0.1467571 0.1140339 0.0046796 0.1264151 0.2401807 -0.088089 0.0459668 0.0575726 0.1099028 0.0783573 -0.0724169 0.1350802 -0.0917865 -0.1133241 0.1908604 -0.059044 0.0429607 0.0625207 0.0370242 0.0631555 -0.0273806 0.0691434 0.0766872 -0.160412 -0.0496597 -0.0607719 -0.1101507 0.0001691 -0.094901 -0.104976 -0.076317 0.0636897 unknown
polarizability: 193.3630291|16.9168495|155.5282541|-7.87516|-0.3213498|67.2464822 unknown
InChI: InChI=1S/C11H12N2O/c1-12-11(14)13-8-4-6-9-5-2-3-7-10(9)13/h2-7,12H,8H2,1H3
charge 0 multiplicity 1
26 atoms
O  1.897278 -1.620951 0.602204
N  0.751408 0.340028 -0.099522
N  3.106876 0.127854 -0.340928
C  -0.569913 -0.226679 -0.073403
C  0.937595 1.796517 -0.370776
C  -1.693305 0.649358 0.092099
C  -0.253894 2.640877 0.019978
C  -1.477212 2.091099 0.231294
C  -0.804474 -1.619527 -0.212826
C  -3.004764 0.111991 0.119974
C  1.913295 -0.462918 0.085044
C  -2.121343 -2.127899 -0.189863
C  -3.232416 -1.270504 -0.020965
C  4.387802 -0.563953 -0.158019
H  1.17371 1.967486 -1.450891
H  1.815179 2.138489 0.211483
H  -0.081405 3.71959 0.104136
H  -2.334344 2.720608 0.497819
H  0.038171 -2.304575 -0.30466
H  -3.848279 0.800845 0.252088
H  -2.272298 -3.207609 -0.299877
H  -4.250298 -1.672881 0.00277
H  3.09327 0.961677 -0.926052
H  4.799274 -0.924872 -1.120249
H  4.205477 -1.436819 0.487826
H  5.129407 0.098366 0.324814
