program: Gaussian 09
title: 000207818
version: EM64L-G09RevD.01
frameworkgroup: C1[X(C11H8F3NO)]
method: RPBEPBE
basis: SDD
operation: Freq
keyword: #p
keyword: freq=noraman
keyword: PBEPBE/SDD
title: #p freq=noraman PBEPBE/SDD
converged: NO YES NO NO
title: Mulliken charges:
elementType: F F F O N C C C C C C C C C C C H H H H H H H H
charge: -0.148917 -0.126241 -0.169038 -0.218958 -0.243526 0.280331 -0.443606 0.355029 -0.188947 -0.319824 -0.335579 0.105575 -0.395062 -0.229011 -0.243462 0.331171 0.275084 0.253390 0.236447 0.242618 0.270530 0.240516 0.236337 0.235143
chargesum: 0.00000
title: Mulliken charges with hydrogens summed into heavy atoms:
elementType: F F F O N C C C C C C C C C C C
charge: -0.148917 -0.126241 -0.169038 -0.218958 -0.243526 0.280331 0.084869 0.355029 0.047500 -0.077207 -0.065048 0.105575 -0.154546 0.007325 -0.008319 0.331171
polarizability: 1.55351631e+02 -2.39211586e+01 1.55953611e+02 1.85928596e+01 8.71261926e+00 7.77051100e+01
1716.lowfreq: -12.2635 -0.0010 0.0000 0.0005 4.3744 7.4793 50.0729 58.6343 68.6859
frequency: 50.0485 58.6203 68.6757 97.8015 157.9083 189.9765 221.2069 245.4279 284.3770 344.0865 365.5287 376.4817 389.9962 429.7726 450.6621 484.3386 498.0071 510.9275 560.6660 568.6413 630.0755 666.7389 689.6420 693.1354 749.6164 761.2035 783.3912 823.8235 856.0050 880.8954 948.1392 957.8333 968.9359 981.5493 988.5888 995.4542 1022.6098 1043.8990 1058.6394 1108.3281 1127.1933 1167.7908 1179.5871 1203.9347 1223.2012 1242.5716 1292.4110 1326.3558 1360.5551 1378.5777 1388.7614 1446.1047 1472.1404 1489.4854 1572.8201 1592.4814 1612.0410 1648.6067 2959.7222 3079.6940 3130.3867 3133.6347 3145.6465 3163.3616 3165.3163 3183.4412
redmass: 8.2835 6.8596 12.5738 4.1469 3.9800 6.3289 6.1705 8.0158 4.4030 5.3550 6.1321 9.7648 3.4356 6.6459 9.2467 5.0212 6.7680 6.1076 3.2181 5.9913 11.5848 7.5159 3.3298 2.2993 4.0488 1.8306 1.9650 4.9718 3.9157 1.4582 1.6738 2.1056 1.4152 2.6033 1.4914 4.9524 3.3974 2.7527 5.2471 4.2868 1.8688 1.2039 1.0852 1.5301 1.9716 2.2087 1.6390 2.0134 2.4827 2.2189 3.8326 2.4072 1.1807 2.4070 7.0936 9.8929 6.6155 6.7614 1.0695 1.0913 1.0877 1.0865 1.0900 1.1003 1.0967 1.0966
irintensity: 0.0989 1.6548 0.4371 1.0368 3.5464 0.0167 1.6907 5.1769 0.5784 5.0086 6.2840 1.3148 0.0711 1.0328 6.5087 0.8869 15.6936 6.4052 5.0752 6.3979 25.1880 0.8442 17.3242 8.8720 11.4401 21.4730 106.0108 2.4802 23.1490 2.7465 4.5406 12.0860 6.0543 64.0917 12.3767 151.7221 9.9432 65.2757 89.4239 229.4233 43.5463 12.1344 0.9677 14.4461 7.6612 1.3481 2.0805 14.6876 16.1419 5.9809 4.3044 13.9847 15.0936 75.0149 116.0672 286.5926 11.2066 4.4918 29.1151 2.6801 2.6027 4.5199 10.0824 21.0266 20.8493 4.3792
temp: 298.150 k
press: 1.00000 atm
elementType: 9 9 9 8 7 6 6 6 6 6 6 6 6 6 6 6 1 1 1 1 1 1 1 1
symmnumber: 1
zpe: 440509.7 jmol-1
zpe.correction: 0.167781 hartree
zpe.thermalcorrener: 0.180926 hartree
zpe.thermalcorrenthalpy: 0.181870 hartree
zpe.thermalcorrgfe: 0.127523 hartree
zpe.sumelectzpe: -852.317689 hartree
zpe.sumelectthermal: -852.304544 hartree
zpe.sumelectthermalent: -852.303600 hartree
zpe.sumelectthermalfe: -852.357947 hartree
dipole: 5.2843 0.7641 -0.5416
dipole: 5.3666
quadrupole: -95.8235 -81.6374 -91.4219
quadrupole: 1.8597 2.9074 3.2264
quadrupole: -6.1959 7.9902 -1.7943 1.8597 2.9074 3.2264
hfenergy: -852.4854702 hartree
pointgroup: C01 [X(C11H8F3N1O1)]
dipole: 2.0609695 0.3296277 -0.3189754 debye
dipolederiv: -0.5434123 0.0230184 -0.1604415 0.0259587 -0.3594873 0.186236 -0.1165814 0.1535165 -0.5431144 -0.7383658 0.0276461 0.2110818 -0.0631713 -0.2787259 0.0174712 0.3175104 -0.0157719 -0.3837554 -0.4195036 -0.1236258 -0.0400301 -0.2051849 -0.5598546 -0.2310505 0.028227 -0.1655894 -0.5321002 -1.2057518 0.1645693 0.021914 0.575575 -0.5665959 0.0740573 -0.1663302 0.1067919 -0.3405853 -1.2544175 0.27909 -0.0190024 -0.0984827 -0.4400015 0.0899932 0.1400616 0.0412434 -0.2627034 0.5192411 -0.3227239 0.035628 -0.3820651 0.1624584 0.0590745 0.0267658 0.0311178 0.0808542 -0.0230641 0.0097217 -0.0639886 0.1726283 0.2850372 -0.1002882 -0.088821 -0.0416745 0.2830394 -0.1472792 0.0533763 -0.0520796 -0.0227535 0.1558934 -0.0089775 -0.034683 -0.0495905 -0.0117923 0.035854 -0.0068921 0.1410349 -0.0273827 -0.1053696 0.069329 0.1760042 -0.0124557 -0.1088427 0.0068361 0.0342561 0.1306701 0.0713508 0.1022087 0.0698138 0.1047573 0.1974036 -0.068784 -0.0604838 0.0807255 0.0653445 0.1078175 -0.1371147 0.0233634 0.047217 0.0053666 -0.1042432 1.8714087 -0.254129 -0.0976757 -0.3247064 0.4425705 -0.1968667 0.0325601 -0.1976563 0.1633181 0.0763521 0.0370285 0.1018073 0.0671525 -0.0754291 0.0552359 0.1166866 0.0209188 -0.1015357 -0.0431862 -0.0200594 0.0448024 -0.0157177 0.0497138 0.0851893 0.0338068 0.0608272 -0.0998226 0.0040849 -0.1305385 0.0392812 -0.0840233 0.0020321 0.0123549 0.0305327 0.0028281 -0.1327269 1.6734762 0.0686319 -0.0056271 0.2500633 1.0792653 0.0809368 -0.2600346 0.0950978 1.4625595 0.0631844 0.0907442 -0.0024985 0.0125475 0.0771683 -0.01154 0.0184125 -0.0173768 0.1065819 0.0569003 -0.0233502 0.0488767 -0.094107 0.0940228 -0.0324514 0.0159128 0.0841115 -0.1186628 0.0756056 0.01774 -0.0439631 -0.0292149 -0.0723479 -0.0467221 -0.0751038 -0.0843847 0.1348191 -0.0120384 -0.0558486 -0.1224691 0.0058092 0.0548328 -0.0286894 -0.105816 -0.0683514 0.0775597 0.0384352 -0.0194086 -0.0860134 0.0034275 0.0895168 -0.0197977 -0.0858681 -0.0261548 0.1265956 -0.0398555 -0.0380257 -0.0814636 -0.0707954 0.0636968 -0.0583187 -0.0947448 -0.0319997 0.1087365 0.0929439 -0.0078152 -0.0292301 0.0160002 -0.0722468 -0.0816693 -0.0246298 -0.0832054 0.1177579 -0.0269643 0.115869 -0.0359581 0.1092742 0.0087563 -0.0066839 -0.0358422 -0.0050121 0.1468471 unknown
polarizability: 157.7214453|-23.3351122|155.3747198|14.6182751|9.608059|75.9141866 unknown
InChI: InChI=1S/C11H8F3NO/c12-11(13,14)10(16)15-7-3-5-8-4-1-2-6-9(8)15/h1-6H,7H2
charge 0 multiplicity 1
24 atoms
F  -1.28042 -1.184237 1.48053
F  -3.403149 -0.511645 1.159608
F  -2.382975 -1.725207 -0.447139
O  -2.634594 1.502026 -0.400424
N  -0.383909 0.871282 -0.396564
C  0.708718 -0.069931 -0.311986
C  0.002569 2.284048 -0.694871
C  1.920087 0.398935 0.28827
C  1.125809 2.72027 0.228612
C  2.019333 1.806097 0.699722
C  0.624067 -1.382892 -0.822521
C  -1.734811 0.64914 -0.16039
C  3.003474 -0.503624 0.426884
C  1.720709 -2.262142 -0.680744
C  2.907016 -1.829753 -0.044497
C  -2.180659 -0.690216 0.509427
H  -0.903045 2.898885 -0.568007
H  0.310105 2.366386 -1.758811
H  1.200812 3.785316 0.471919
H  2.849838 2.106118 1.348477
H  -0.280366 -1.722739 -1.333167
H  3.928896 -0.151798 0.897672
H  1.645896 -3.28116 -1.074231
H  3.752597 -2.51606 0.067833
