program: Gaussian 09
title: 000207814
version: EM64L-G09RevD.01
frameworkgroup: C1[X(C12H13NO2)]
method: RPBEPBE
basis: SDD
operation: Freq
keyword: #p
keyword: freq=noraman
keyword: PBEPBE/SDD
title: #p freq=noraman PBEPBE/SDD
converged: NO YES NO NO
title: Mulliken charges:
elementType: O O N C C C C C C C C C C C C H H H H H H H H H H H H H
charge: -0.236946 -0.259047 -0.233692 -0.190743 0.229709 0.356887 -0.215393 -0.315377 -0.324021 0.233865 -0.405458 -0.242196 -0.261618 -0.822125 -0.525009 0.247657 0.236934 0.241082 0.310108 0.231617 0.230085 0.231090 0.286130 0.235647 0.269112 0.230495 0.226724 0.234482
chargesum: 0.00000
title: Mulliken charges with hydrogens summed into heavy atoms:
elementType: O O N C C C C C C C C C C C C
charge: -0.236946 -0.259047 -0.233692 0.056915 0.229709 0.356887 0.021541 -0.074295 -0.013913 0.233865 -0.173840 -0.012111 -0.030528 -0.031236 0.166691
polarizability: 1.90521314e+02 5.57085531e+00 1.49776268e+02 8.62463484e+00 1.53207603e+01 8.97193485e+01
1716.lowfreq: -8.8766 -0.0010 -0.0009 -0.0004 6.3345 7.5103 47.0955 79.4253 81.6601
frequency: 47.0638 79.4208 81.6587 96.9931 151.8443 192.8470 212.6662 240.5616 244.6212 285.4244 321.0073 364.9152 379.4011 400.0383 440.0201 475.5885 503.4729 535.3694 559.9170 576.3803 589.3465 642.0124 675.3306 714.5121 762.5962 786.2691 800.7120 816.7844 836.1755 878.9107 932.6883 951.5343 977.4300 980.7604 985.8601 989.5546 1028.0468 1041.3410 1053.2080 1094.3270 1113.2211 1126.2507 1154.8496 1175.5296 1186.5471 1207.9598 1236.0331 1266.8439 1294.0271 1339.5306 1365.5914 1383.5253 1388.2247 1397.2925 1428.5353 1446.4892 1460.6044 1464.3183 1476.6551 1482.4398 1486.1168 1573.6137 1601.2098 1613.1840 1662.9043 2967.2344 2990.7709 3056.3726 3084.8732 3095.7351 3112.3038 3122.8895 3126.3533 3131.8881 3139.0784 3163.6894 3166.9551 3218.5235
redmass: 5.8835 3.9139 3.7541 2.6721 1.6491 2.3166 2.7152 4.3820 1.0845 3.9931 4.0695 4.0760 5.3944 3.4586 5.3083 3.6136 4.8973 3.8186 4.4626 4.2933 3.2900 5.0530 5.3711 2.1964 1.4736 2.7023 3.4300 4.8164 3.1316 1.4614 4.0260 1.3773 1.3295 6.4305 2.8188 1.4106 2.6306 1.6884 2.0206 2.7209 1.2781 1.7648 1.4022 1.1461 1.2466 2.5126 1.8863 3.5936 1.6277 1.1848 1.5320 1.3400 4.1309 1.8384 1.1314 2.2943 1.0544 1.1032 1.0543 1.1266 2.2972 6.7215 6.7870 7.0973 7.0052 1.0312 1.0393 1.1036 1.0954 1.0857 1.1009 1.0881 1.0878 1.0999 1.0902 1.0991 1.0981 1.0935
irintensity: 2.5110 2.9112 0.1237 3.0768 3.4637 5.5805 2.1090 4.8305 0.0293 2.6832 3.8744 1.2664 1.1738 4.9534 4.5051 10.5492 1.0059 5.3538 6.2203 20.4464 2.0493 13.3684 4.0511 7.7564 51.3620 10.5409 40.5119 4.1244 73.3806 1.8937 39.8600 1.6039 3.1918 133.7547 12.7802 2.1187 8.0716 14.4932 20.6353 38.4969 0.9029 3.6168 1.7664 3.4774 19.6035 61.2986 14.8886 325.9286 14.6456 14.2371 11.3081 57.0169 1.0787 44.8201 2.8135 19.6258 13.1125 27.8173 9.4187 18.1117 71.6556 4.3624 112.0193 76.1025 22.4543 39.5754 5.4565 35.5387 7.2233 12.9789 26.7116 0.8306 13.5819 5.2989 16.0186 30.8508 12.4914 6.5391
temp: 298.150 k
press: 1.00000 atm
elementType: 8 8 7 6 6 6 6 6 6 6 6 6 6 6 6 1 1 1 1 1 1 1 1 1 1 1 1 1
symmnumber: 1
zpe: 588770.7 jmol-1
zpe.correction: 0.224251 hartree
zpe.thermalcorrener: 0.237674 hartree
zpe.thermalcorrenthalpy: 0.238618 hartree
zpe.thermalcorrgfe: 0.184380 hartree
zpe.sumelectzpe: -669.172232 hartree
zpe.sumelectthermal: -669.158810 hartree
zpe.sumelectthermalent: -669.157865 hartree
zpe.sumelectthermalfe: -669.212103 hartree
dipole: 0.5650 -3.1363 -0.0115
dipole: 3.1868
quadrupole: -79.8698 -91.8623 -86.6427
quadrupole: -1.0531 3.6380 3.6217
quadrupole: 6.2551 -5.7374 -0.5177 -1.0531 3.6380 3.6217
hfenergy: -669.3964831 hartree
pointgroup: C01 [X(C12H13N1O2)]
dipole: 0.0745527 -1.243266 0.1439179 debye
polarizability: 185.5381122|8.7531552|146.4355913|24.6948284|-17.43559|98.0432272 unknown
InChI: InChI=1S/C12H13NO2/c1-9(14)13-11-6-4-3-5-10(11)7-8-12(13)15-2/h3-8,12H,1-2H3
charge 0 multiplicity 1
28 atoms
O  2.723312 -0.906134 -0.368927
O  0.620369 2.835035 -0.019742
N  0.85466 0.520562 0.383361
C  1.82787 -0.540435 0.765122
C  -0.500318 0.163691 0.033795
C  -1.000985 -1.1124 0.461245
C  1.184358 -1.75123 1.379278
C  -0.138843 -2.021012 1.209309
C  -1.359015 1.017949 -0.710402
C  1.349775 1.857441 0.309396
C  -2.334991 -1.48529 0.151883
C  -2.677402 0.61576 -1.013276
C  -3.179435 -0.633757 -0.582259
C  2.820367 2.086857 0.655141
C  2.052091 -1.544296 -1.514403
H  2.553654 -0.110872 1.469328
H  1.853399 -2.422831 1.925357
H  -0.583895 -2.93199 1.627015
H  -1.00536 1.99808 -1.02459
H  -2.696255 -2.46246 0.494844
H  -3.316026 1.295279 -1.588357
H  -4.206265 -0.933318 -0.815484
H  3.488918 1.39631 0.114859
H  3.00393 1.978202 1.740865
H  3.052082 3.124758 0.374718
H  1.338578 -0.849893 -1.997398
H  1.520552 -2.466517 -1.212647
H  2.859576 -1.795091 -2.219434
