program: Gaussian 09
title: 000207764
version: EM64L-G09RevD.01
frameworkgroup: C1[X(C22H27N3O5)]
method: RPBEPBE
basis: SDD
operation: Freq
keyword: #p
keyword: freq=noraman
keyword: PBEPBE/SDD
title: #p freq=noraman PBEPBE/SDD
converged: YES YES NO NO
title: Mulliken charges:
elementType: O O O O O N N N C C C C C C C C C C C C C C C C C C C C C C H H H H H H H H H H H H H H H H H H H H H H H H H H H
charge: -0.292761 -0.285824 -0.302964 -0.290417 -0.309154 -0.117127 -0.397014 -0.691748 -0.133393 -0.429371 -0.423605 -0.384791 -0.427574 0.132696 0.169435 0.261413 0.369445 -0.352863 -0.368181 -0.526000 -0.556158 -0.450304 -0.420463 0.496819 0.291350 0.239295 0.044930 -0.526509 -0.523433 -0.524201 0.307453 0.219068 0.223574 0.176572 0.232382 0.239026 0.203564 0.216599 0.265719 0.318401 0.332501 0.260827 0.244785 0.296230 0.222542 0.215146 0.304720 0.306510 0.227086 0.232996 0.248934 0.230830 0.215843 0.264153 0.229569 0.260542 0.232900
chargesum: 0.00000
title: Mulliken charges with hydrogens summed into heavy atoms:
elementType: O O O O O N N N C C C C C C C C C C C C C C C C C C C C C C
charge: -0.292761 -0.285824 -0.302964 -0.290417 -0.309154 -0.117127 -0.078612 -0.080519 0.174060 0.013271 -0.014650 0.057800 0.054744 0.132696 0.169435 0.261413 0.369445 -0.020362 -0.107354 -0.281216 -0.259928 -0.227762 -0.205318 0.496819 0.291350 0.239295 0.044930 0.182507 0.187394 0.198810
polarizability: 3.91690593e+02 2.55270028e+01 3.03918130e+02 -1.24962233e+01 -6.76411013e+00 1.96150115e+02
1716.lowfreq: -6.7556 -1.4312 -0.0006 0.0007 0.0008 1.9442 11.0179 19.3668 34.7732
frequency: 10.3413 19.0790 34.7608 42.1346 56.3815 63.5809 70.5273 71.5034 76.3435 82.1918 89.9599 97.5596 122.6473 126.8368 149.6061 152.5775 160.1183 171.1115 178.1240 192.7020 204.6748 214.9725 230.6355 249.3994 266.6218 280.9289 282.5528 298.5636 322.7617 353.9151 366.4120 368.3695 371.5456 378.2258 390.3819 395.2202 410.6606 418.5876 422.3219 455.0425 488.7067 498.0918 518.7780 534.8607 541.1425 559.1912 579.1117 596.6764 612.8701 626.8581 633.6737 647.2757 666.0219 694.6667 712.0648 745.7541 756.7377 768.0897 775.0960 804.2573 816.2857 825.9735 829.6710 846.6936 862.1132 865.0857 877.8369 886.7442 889.9778 921.7003 934.8781 939.7136 962.2117 976.3134 987.0057 1002.6927 1009.4559 1014.4648 1020.4972 1037.0863 1040.8011 1076.8095 1085.2919 1099.6751 1110.1926 1111.6576 1114.0340 1121.4870 1136.1298 1147.0584 1151.5346 1156.4150 1158.6739 1175.2569 1186.8394 1198.2301 1204.4845 1208.9447 1237.9415 1257.4333 1266.9159 1284.5794 1310.4473 1314.0491 1325.4205 1333.4548 1334.1131 1338.7087 1346.0632 1354.8312 1359.3190 1380.3316 1388.6616 1391.3923 1415.0184 1434.5435 1436.0556 1440.0099 1447.5535 1449.4745 1456.4116 1457.7616 1458.8617 1462.4299 1467.1295 1474.7887 1476.9249 1484.1489 1486.5678 1496.4036 1518.6536 1532.5928 1560.7025 1576.6349 1601.8650 1603.5228 1628.1378 1642.2269 2949.4781 2975.1083 2977.6064 2982.5448 2992.1506 2993.9039 2994.9902 3032.1105 3053.8567 3059.3961 3072.9829 3084.5679 3086.0673 3093.6326 3102.7766 3114.3165 3118.7208 3124.8237 3126.3037 3130.3919 3130.8001 3146.4698 3156.3841 3177.1150 3546.6135 3563.5731 3704.2449
redmass: 4.9585 5.3993 5.2114 5.3824 4.7477 4.0224 4.9752 3.4801 2.9070 3.4229 5.2357 2.8021 2.4097 2.9955 3.1659 2.1893 1.0874 2.9685 1.2947 4.3073 3.4529 3.0937 5.0505 4.4231 3.6727 5.2240 4.4492 4.8535 4.3061 3.5165 4.5386 3.9893 1.2960 3.0445 3.3596 1.0354 4.0443 3.2131 3.8123 3.9128 4.4698 4.1608 5.4922 3.4806 2.6565 2.4119 2.5737 2.7497 3.8491 3.7914 6.1259 4.4880 5.7119 4.2182 3.8049 4.5097 4.6598 5.5354 4.6770 2.3255 2.5592 1.4432 2.5668 1.6849 2.5966 4.0092 2.1403 2.0692 4.8231 1.5581 2.9323 5.8182 1.3839 2.9944 3.0217 2.5105 3.0435 1.3927 1.4458 6.2880 2.1528 1.8394 1.7885 2.1381 1.2405 1.2378 1.2416 3.2866 1.2499 1.4991 1.5100 1.8709 1.4608 3.1064 1.7699 1.2773 1.4411 1.7409 1.8170 1.2752 1.9227 1.5982 2.6050 2.0394 1.7635 1.5081 1.4083 1.5212 1.5096 1.5127 6.9455 4.6370 1.8205 2.0264 1.3285 1.2672 1.4221 3.5915 1.4794 1.3096 1.0838 1.1258 1.0601 1.1045 1.0874 1.3769 1.1241 1.0540 1.0549 1.5443 2.9716 6.2902 7.5028 6.5851 7.5531 6.6249 3.1948 1.4153 1.0680 1.0307 1.0337 1.0297 1.0626 1.0619 1.0658 1.0917 1.1028 1.1025 1.1044 1.1048 1.0991 1.0861 1.0961 1.0893 1.0891 1.1027 1.1036 1.1046 1.0971 1.0913 1.0951 1.0923 1.0765 1.0448 1.1040
irintensity: 0.1941 1.1333 0.5061 6.3103 1.7326 0.8322 3.0829 1.1374 1.2382 4.6171 4.4201 8.8553 0.9222 0.7820 1.3199 4.4026 0.1630 2.4901 1.3784 1.3852 3.4177 10.8631 12.2073 6.8363 1.5758 19.2293 0.4649 1.6958 3.9041 10.5280 8.9287 3.3790 283.2192 0.4820 2.7244 9.1795 1.5936 3.4971 22.1944 19.0611 6.3923 5.7734 4.7089 54.0213 6.9428 23.0098 21.1574 29.6045 3.9930 9.5008 2.5470 8.6760 20.6385 12.2292 8.3192 18.9914 14.4669 8.6192 6.2129 2.1396 4.3036 10.6682 19.9855 66.4272 16.5847 0.4579 9.5114 4.4928 33.7582 23.6763 47.4561 55.4799 1.4962 29.0679 50.0975 20.6522 154.5391 6.6602 13.3641 169.2256 6.2991 22.8350 8.6718 22.1372 15.6020 7.7946 2.0271 21.6952 18.2129 8.6836 6.7187 47.1713 21.8954 100.2746 32.8100 95.1104 22.6133 14.3909 21.6321 46.9863 195.4900 28.6330 232.6980 56.0535 264.0381 12.1495 8.0495 129.9200 14.0869 67.8898 14.8173 9.9142 73.0818 41.7484 22.1384 43.7155 9.1708 18.7485 169.8186 123.0717 7.0892 27.1226 16.8038 29.2410 13.9781 90.5198 16.6882 19.9881 36.2677 184.1172 76.4406 97.6044 188.8616 42.9449 112.9853 7.0335 108.8349 360.6734 50.9051 59.9531 99.1203 61.2032 19.5562 49.5749 31.3323 62.5004 23.4360 75.1920 25.4311 17.0067 33.1253 4.9148 3.6614 69.9582 9.2170 22.1623 22.8713 17.8728 54.6427 4.7189 12.2796 3.6440 15.3341 93.8131 20.0563
temp: 298.150 k
press: 1.00000 atm
elementType: 8 8 8 8 8 7 7 7 6 6 6 6 6 6 6 6 6 6 6 6 6 6 6 6 6 6 6 6 6 6 1 1 1 1 1 1 1 1 1 1 1 1 1 1 1 1 1 1 1 1 1 1 1 1 1 1 1
symmnumber: 1
zpe: 1208962.4 jmol-1
zpe.correction: 0.460469 hartree
zpe.thermalcorrener: 0.490538 hartree
zpe.thermalcorrenthalpy: 0.491482 hartree
zpe.thermalcorrgfe: 0.397417 hartree
zpe.sumelectzpe: -1392.669316 hartree
zpe.sumelectthermal: -1392.639248 hartree
zpe.sumelectthermalent: -1392.638303 hartree
zpe.sumelectthermalfe: -1392.732369 hartree
dipole: 4.6849 -0.7366 4.8050
dipole: 6.7512
quadrupole: -139.2345 -154.8442 -180.0442
quadrupole: 11.6364 -21.5901 -2.6246
quadrupole: 18.8065 3.1967 -22.0032 11.6364 -21.5901 -2.6246
hfenergy: -1393.1297857 hartree
pointgroup: C01 [X(C22H27N3O5)]
dipole: 1.9417693 -0.491864 -1.7443186 debye
polarizability: 380.2078059|-31.2366021|300.5427432|28.1966753|-38.8569271|211.0082886 unknown
InChI: InChI=1S/C22H27N3O5/c1-28-17-12-15(13-18(29-2)20(17)30-3)21(26)24-19-6-4-5-11-25(19)22(27)14-7-9-16(23)10-8-14/h7-10,12-13,19,24H,4-6,11,23H2,1-3H3
charge 0 multiplicity 1
57 atoms
O  -4.535529 -0.345884 1.941604
O  -0.073864 1.238604 -0.452621
O  4.773094 2.004599 0.979614
O  4.521113 -2.727372 -0.48428
O  6.106868 -0.513749 0.505387
N  -2.507287 -0.78312 0.893256
N  -0.341363 -1.0659 -0.239796
N  -5.480901 3.920833 -2.753622
C  -1.806778 -1.086885 -0.389947
C  -2.246888 -2.493307 -0.885465
C  -2.027486 -3.589059 0.189531
C  -2.673128 -3.186748 1.539158
C  -2.223652 -1.769736 1.967612
C  -3.73854 -0.097544 0.973254
C  0.430835 0.083477 -0.288934
C  -4.11115 0.919881 -0.061778
C  1.917278 -0.11077 -0.125108
C  -3.19438 1.815551 -0.678136
C  -5.496828 1.07372 -0.344097
C  2.575579 -1.328202 -0.425664
C  2.67381 1.003298 0.309615
C  -3.648085 2.810297 -1.562173
C  -5.956729 2.051217 -1.239334
C  -5.034363 2.940599 -1.868569
C  4.063406 0.885586 0.488533
C  3.97093 -1.458173 -0.241105
C  4.724234 -0.358173 0.260687
C  5.811823 2.536583 0.065564
C  5.726643 -2.796913 -1.342038
C  6.482976 -0.403552 1.939614
H  -2.08738 -0.319296 -1.125418
H  -1.709899 -2.739305 -1.821389
H  -3.324503 -2.431462 -1.127836
H  -0.9415 -3.77518 0.340364
H  -2.447023 -4.547287 -0.170102
H  -3.775642 -3.186358 1.445976
H  -2.407899 -3.917978 2.326374
H  -1.137708 -1.749238 2.182372
H  -2.770958 -1.446698 2.86576
H  0.117435 -1.950104 -0.016315
H  -2.123543 1.760305 -0.449228
H  -6.206283 0.417518 0.171042
H  2.050844 -2.195691 -0.839503
H  2.175974 1.958187 0.498546
H  -2.924436 3.501071 -2.01249
H  -7.029743 2.143331 -1.448989
H  -6.470858 4.03193 -2.952012
H  -4.827318 4.566981 -3.186153
H  5.342044 2.903778 -0.86611
H  6.273139 3.375556 0.607936
H  6.566097 1.764355 -0.169361
H  5.978449 -3.867128 -1.388801
H  5.49128 -2.421318 -2.356421
H  6.555061 -2.21706 -0.904634
H  7.577828 -0.512131 1.96274
H  6.179954 0.57841 2.343355
H  6.007153 -1.21855 2.514733
