program: Gaussian 09
title: 000207755
version: EM64L-G09RevD.01
frameworkgroup: C1[X(C6H7NO2S)]
method: RPBEPBE
basis: SDD
operation: Freq
keyword: #p
keyword: freq=noraman
keyword: PBEPBE/SDD
title: #p freq=noraman PBEPBE/SDD
converged: NO NO NO NO
title: Mulliken charges:
elementType: S O O N C C C C C C H H H H H H H
charge: 0.272880 -0.428713 -0.241585 -0.007333 -0.404431 -0.100422 -0.678593 -0.197833 -0.247627 0.171413 0.247440 0.247432 0.228335 0.231291 0.228319 0.290977 0.388450
chargesum: 0.00000
title: Mulliken charges with hydrogens summed into heavy atoms:
elementType: S O O N C C C C C C
charge: 0.272880 -0.040263 -0.241585 -0.007333 0.090441 -0.100422 0.009351 -0.197833 0.043351 0.171413
polarizability: 1.38873217e+02 5.31819709e+00 9.81750522e+01 -1.26768507e-03 1.30054717e-03 4.63935989e+01
1716.lowfreq: -31.2171 -3.0630 0.0016 0.0021 0.0024 6.4273 13.4127 77.3788 100.6822
frequency: -30.6897 77.3677 100.6812 123.4676 203.8241 219.6597 277.2553 330.9081 394.4092 465.3104 468.6744 534.9922 561.0864 591.0965 598.3088 656.1660 713.1867 739.4629 771.9270 889.0228 935.5060 965.3541 1059.2674 1072.1584 1117.1003 1141.0701 1208.6094 1242.5802 1253.7837 1311.7077 1322.5094 1396.9485 1439.6582 1460.7579 1481.2929 1485.0546 1495.7883 1644.3904 2987.2480 2988.6047 3032.2976 3084.7856 3092.4991 3212.9255 3530.3401
redmass: 2.3063 8.6351 4.1174 5.0910 4.7684 1.4658 2.3225 8.7907 5.4307 6.7018 3.4890 5.2831 1.3687 5.8760 2.9307 6.4932 7.7378 6.6160 1.2381 1.4479 1.8684 7.7568 3.2831 1.4651 2.3461 1.8332 2.8719 1.1625 2.1114 1.7635 2.5767 1.2154 1.1954 3.8320 1.0393 1.1310 6.6803 8.6384 1.0604 1.0360 1.0992 1.1007 1.0993 1.0964 1.0643
irintensity: 0.0539 1.8374 1.0442 2.2064 1.1658 0.0713 1.1792 9.5494 1.1043 7.6151 34.9814 2.7970 114.8759 42.0429 5.2778 17.6762 49.3123 4.6442 7.1292 16.2571 32.4533 231.4495 13.7777 0.4222 30.1993 184.8457 1.7055 0.0380 1.8937 91.5002 17.4616 14.0112 38.7403 88.6898 15.8258 54.6222 8.0011 354.0949 6.9288 16.5454 2.6370 32.3149 33.6006 1.1761 54.0414
temp: 298.150 k
press: 1.00000 atm
elementType: 16 8 8 7 6 6 6 6 6 6 1 1 1 1 1 1 1
symmnumber: 1
zpe: 321072.0 jmol-1
zpe.correction: 0.122290 hartree
zpe.thermalcorrener: 0.131539 hartree
zpe.thermalcorrenthalpy: 0.132483 hartree
zpe.thermalcorrgfe: 0.087332 hartree
zpe.sumelectzpe: -835.350971 hartree
zpe.sumelectthermal: -835.341723 hartree
zpe.sumelectthermalent: -835.340778 hartree
zpe.sumelectthermalfe: -835.385929 hartree
dipole: 1.5911 0.6630 0.0019
dipole: 1.7237
quadrupole: -50.3039 -74.4386 -66.0047
quadrupole: -7.0355 -0.0015 -0.0004
quadrupole: 13.2785 -10.8562 -2.4223 -7.0355 -0.0015 -0.0004
hfenergy: -835.4732612 hartree
pointgroup: C01 [X(C6H7N1O2S1)]
dipole: -0.632007 0.1645893 0.1826687 debye
dipolederiv: 0.0229596 0.079911 0.071708 0.154837 -0.1776569 -0.2582159 0.1278029 -0.2510109 -0.0553711 -1.0744052 -0.3885607 -0.2318687 -0.5248365 -0.6058728 -0.0809151 -0.3338862 -0.0935131 -0.4711027 -0.8355405 0.1770715 0.1810664 0.1760452 -0.6955341 -0.2914767 0.1807349 -0.2922183 -0.5669879 -0.8726715 -0.118455 -0.0255992 -0.2955675 -0.4955654 -0.1985571 -0.1596598 -0.2153578 -0.342649 -0.1905389 -0.0293124 0.0080906 0.1889831 0.0741465 -0.0617565 0.1721382 -0.0414562 0.0853306 0.7584361 -0.0479551 -0.1144724 0.0282635 0.4075141 0.3662287 -0.056544 0.3736534 0.204732 -0.0271738 -0.043108 -0.0223754 -0.0269781 0.0066269 -0.0529864 -0.0102195 -0.0514995 0.0425211 -0.7353428 0.2409832 0.23828 0.4915432 -0.0690512 0.0024525 0.4273523 0.0260006 -0.154671 0.4598645 -0.0136873 -0.0564099 -0.1905795 0.0878997 0.1057894 -0.1895675 0.0890661 0.0566852 2.1511046 0.0205118 -0.161468 0.0099321 0.9556305 0.5058176 -0.1701443 0.5051531 0.678188 -0.0021042 -0.0202525 0.0321143 -0.0810367 0.0945077 0.0024151 0.0140175 -0.0079482 -0.0827829 -0.0167975 0.035899 -0.020119 0.0009193 -0.0682898 0.0379286 -0.0740615 0.0393623 0.094628 0.1085279 0.0010932 0.0928637 -0.0321954 0.0595553 0.0234511 0.0470283 0.0149859 -0.116377 -0.1927217 -0.0451076 -0.0052971 -0.0031152 0.1027471 -0.0083924 0.0262903 -0.0044686 0.1084843 0.0854284 0.1130528 -0.0363722 0.059204 -0.0793346 0.0503317 -0.0560353 0.0506883 0.0455418 0.0880215 -0.0242531 -0.0094934 -0.0751617 0.1067727 -0.0491021 -0.0479516 -0.0538772 0.1451735 0.2729535 0.0621692 0.0593524 0.1197432 0.2959043 -0.0930123 0.1027051 -0.0875601 0.3286572 unknown
polarizability: 138.640179|0.9511284|79.13197|-7.9761661|24.5816608|65.6697192 unknown
InChI: InChI=1S/C6H7NO2S/c1-2-5-7-3-4(10-5)6(8)9/h3,8H,2H2,1H3
charge 0 multiplicity 1
17 atoms
S  -0.47033 -0.809857 -0.761011
O  3.205208 0.738333 0.056935
O  2.651154 -1.098282 -1.273461
N  -0.92112 1.276245 0.853598
C  -3.061951 0.141286 0.197786
C  -1.566765 0.315808 0.189928
C  -3.594556 -1.037977 -0.640187
C  0.912581 0.173799 -0.150596
C  0.454965 1.203874 0.66941
C  2.287485 -0.155126 -0.528094
H  -3.376654 0.033704 1.254324
H  -3.507689 1.092761 -0.152872
H  -3.327252 -0.930046 -1.707056
H  -4.695089 -1.082905 -0.571386
H  -3.194215 -2.003409 -0.280998
H  1.109085 1.92866 1.154322
H  4.121243 0.475532 -0.228342
