program: Gaussian 09
title: 000207752
version: EM64L-G09RevD.01
frameworkgroup: C1[X(C12H14N2)]
method: RPBEPBE
basis: SDD
operation: Freq
keyword: #pfreq=noraman
keyword: PBEPBE/SDD
title: #p freq=noraman PBEPBE/SDD
converged: YES YES NO NO
title: Mulliken charges:
elementType: N N C C C C C C C C C C C C H H H H H H H H H H H H H H
charge: -0.281408 -0.259292 0.265037 -0.497104 0.113281 0.223633 -0.417134 0.180018 -0.468927 -0.818459 -0.363971 -0.416958 -0.235229 -0.253466 0.219678 0.224302 0.239520 0.235720 0.240484 0.225615 0.268649 0.232800 0.229669 0.219729 0.227532 0.231907 0.217264 0.217111
chargesum: 0.00000
title: Mulliken charges with hydrogens summed into heavy atoms:
elementType: N N C C C C C C C C C C C C
charge: -0.281408 0.009357 0.265037 -0.053124 0.113281 0.223633 0.058106 0.180018 -0.002828 -0.136262 -0.136438 -0.185051 -0.017965 -0.036355
polarizability: 1.95494366e+02 8.74754910e+00 1.51418600e+02 -1.67615420e+00 -8.67025835e-02 7.69209537e+01
1716.lowfreq: -13.6548 -5.1822 0.0006 0.0006 0.0007 3.1917 74.4705 98.2265 106.0659
frequency: 74.4650 98.2053 106.0646 153.9250 179.1526 198.0160 222.1612 302.0151 312.8736 339.1514 390.4765 432.4487 475.7443 520.9268 543.7126 560.2107 578.7207 629.4608 646.9894 677.0949 686.8717 746.3700 757.3489 791.4527 833.5119 846.7592 865.9168 925.5431 950.3194 966.4862 980.9008 988.0104 1010.2857 1020.8248 1038.7566 1055.6519 1098.4039 1123.0275 1139.2849 1159.2312 1181.7658 1187.4893 1217.0384 1248.3945 1289.7778 1302.3046 1322.7733 1328.2601 1345.9837 1374.3745 1399.8393 1411.1113 1420.2021 1451.1532 1459.9569 1461.0081 1465.2704 1468.0446 1468.9826 1478.6327 1481.4082 1577.2948 1588.6779 1622.8066 2952.2871 2962.7314 2967.2223 2998.3041 3029.0205 3032.4863 3053.7066 3070.5393 3070.8276 3119.5896 3128.0648 3141.6165 3159.2548 3448.3610
redmass: 3.7646 1.4787 1.4761 3.0997 2.4906 4.4695 2.7390 3.9694 3.0915 1.9061 4.6959 2.8890 4.0346 3.7672 4.3838 4.1068 3.7745 4.3862 1.8603 3.9833 2.8722 1.3321 3.8355 3.2284 2.1659 1.4558 2.5477 1.3795 2.1304 1.2952 2.3675 2.4808 2.3722 2.9398 1.4576 1.8481 1.6322 1.5586 4.0773 1.4020 2.0487 1.2552 1.5134 1.7521 1.6261 1.6028 1.6795 1.5082 1.5181 1.8260 1.3653 3.9022 2.6185 1.2127 1.3372 1.5363 1.1615 1.9242 1.1340 1.2784 1.4095 6.7269 7.2032 7.5358 1.0669 1.0376 1.0653 1.0637 1.0917 1.0977 1.0994 1.0971 1.1040 1.0844 1.0888 1.0951 1.1001 1.0747
irintensity: 0.1715 0.1378 0.4280 1.1215 7.1158 0.1141 0.5387 0.3993 7.3123 19.1718 1.7724 5.6836 0.5232 2.0681 5.3262 2.6123 0.5568 5.7656 64.4739 44.5262 148.1059 102.7153 3.2294 38.1466 2.4250 0.3318 0.9908 2.5115 5.8934 0.0165 3.3033 6.6555 23.1167 11.6040 1.6942 6.1650 2.8844 8.1304 43.9144 5.2276 24.4968 5.8818 13.4323 19.2761 39.2400 36.5031 13.3555 19.2730 30.7096 1.9842 20.5662 26.2204 8.0984 20.8362 6.9901 34.6805 3.5223 1.7605 11.9705 8.4932 17.4564 0.6957 5.1778 2.9465 41.9190 68.0048 48.9257 42.5481 42.8234 24.0637 19.4867 22.0058 46.9486 1.0908 4.7018 42.0563 34.6295 0.6340
temp: 298.150 k
press: 1.00000 atm
elementType: 7 7 6 6 6 6 6 6 6 6 6 6 6 6 1 1 1 1 1 1 1 1 1 1 1 1 1 1
symmnumber: 1
zpe: 616754.7 jmol-1
zpe.correction: 0.234909 hartree
zpe.thermalcorrener: 0.246724 hartree
zpe.thermalcorrenthalpy: 0.247668 hartree
zpe.thermalcorrgfe: 0.197356 hartree
zpe.sumelectzpe: -574.169936 hartree
zpe.sumelectthermal: -574.158122 hartree
zpe.sumelectthermalent: -574.157177 hartree
zpe.sumelectthermalfe: -574.207490 hartree
dipole: 2.2760 0.3593 -0.4779
dipole: 2.3532
quadrupole: -79.2774 -77.4599 -85.2016
quadrupole: 3.2832 -2.1864 1.1482
quadrupole: 1.3689 3.1864 -4.5553 3.2832 -2.1864 1.1482
hfenergy: -574.4048454 hartree
pointgroup: C01 [X(C12H14N2)]
dipole: -0.8910182 0.1371682 0.210803 debye
polarizability: 195.4868586|-8.3743896|151.1721566|-4.9800106|-1.8954357|77.1749041 unknown
InChI: InChI=1S/C12H14N2/c1-9-10-4-2-3-5-12(10)14-8-13-7-6-11(9)14/h2-5,13H,6-8H2,1H3
charge 0 multiplicity 1
28 atoms
N  -0.701734 -0.66059 0.166858
N  -2.990346 -1.48386 0.459054
C  -1.136205 0.686603 0.110673
C  -2.613197 0.996329 0.204979
C  -0.023364 1.530939 0.028696
C  0.694869 -0.690292 0.083804
C  -1.627029 -1.826628 0.067612
C  1.150565 0.676053 0.010354
C  -3.467807 -0.240672 -0.197626
C  -0.027217 3.037532 -0.015125
C  1.588024 -1.784676 0.066071
C  2.544729 0.932585 -0.062668
C  2.968024 -1.499149 -0.010216
C  3.441362 -0.155304 -0.071622
H  -2.874876 1.285885 1.24502
H  -2.862153 1.864751 -0.433832
H  -1.634259 -2.183543 -0.982396
H  -1.246063 -2.640355 0.709358
H  -4.529156 -0.081278 0.06008
H  -3.410623 -0.400313 -1.2914
H  -3.10874 -1.450062 1.480624
H  0.451631 3.475034 0.88281
H  0.528502 3.417626 -0.894072
H  -1.053826 3.440969 -0.070337
H  1.235616 -2.821445 0.107584
H  2.920126 1.961248 -0.113588
H  3.688966 -2.324509 -0.023299
H  4.52028 0.028524 -0.128797
