program: Gaussian 09
title: 000207748
version: EM64L-G09RevD.01
frameworkgroup: C1[X(C11H14N2O2)]
method: RPBEPBE
basis: SDD
operation: Freq
keyword: #p
keyword: freq=noraman
keyword: PBEPBE/SDD
title: #p freq=noraman PBEPBE/SDD
converged: YES YES NO NO
title: Mulliken charges:
elementType: O O N N C C C C C C C C C C C H H H H H H H H H H H H H H
charge: -0.348019 -0.314625 -0.404759 -0.709434 0.116055 0.286247 -0.556620 0.550888 -0.321364 -0.449835 0.171499 -0.327945 -0.624324 -0.080471 -0.543712 0.277660 0.238170 0.217973 0.216725 0.216110 0.374402 0.302297 0.312263 0.219927 0.221491 0.273964 0.237623 0.225251 0.222563
chargesum: 0.00000
title: Mulliken charges with hydrogens summed into heavy atoms:
elementType: O O N N C C C C C C C C C C C
charge: -0.348019 -0.314625 -0.030357 -0.094874 0.116055 0.286247 -0.278960 0.550888 -0.083195 -0.231862 0.171499 0.104889 0.091058 0.157152 -0.095898
polarizability: 2.12878239e+02 8.50657638e+00 1.56968818e+02 6.04333741e+00 -4.65126658e+00 7.49767738e+01
1716.lowfreq: -5.3534 -3.0897 0.0004 0.0007 0.0007 9.4700 32.3989 56.5680 59.8424
frequency: 32.3555 56.5626 59.8373 80.7104 93.5825 117.2128 126.7474 155.6118 174.3673 213.0355 251.8473 300.6470 307.3142 325.1585 357.8139 360.5568 362.1192 391.2550 436.1803 444.4667 488.2665 559.3579 588.1906 632.8322 665.9730 688.8764 747.8839 758.3384 767.2046 781.4094 796.9600 900.6264 907.4515 923.1483 935.0113 964.7740 974.6840 986.5858 1012.7029 1013.8445 1045.9201 1102.0860 1118.8529 1147.8533 1150.5892 1169.8437 1188.2927 1219.0479 1259.5359 1262.8490 1283.6428 1329.5832 1344.4341 1390.1904 1411.6313 1433.4398 1437.4340 1465.5796 1472.3099 1488.6121 1491.6575 1547.2283 1581.8214 1594.3649 1635.3418 1648.3300 1665.9172 2948.1995 2970.1102 3017.8502 3044.2054 3093.2124 3106.6627 3117.5705 3125.1081 3135.2730 3164.8421 3203.8299 3436.8521 3572.4372 3713.5684
redmass: 4.5278 3.9509 3.0376 1.1271 2.8649 3.2135 2.8947 4.7020 3.6506 3.9966 3.9536 3.3561 4.1027 1.1701 3.4551 2.6137 1.5681 4.8745 2.8030 2.9298 4.0464 3.6496 4.6517 1.7602 6.1080 4.1195 1.1205 4.4952 4.6392 4.5020 1.5556 3.8747 1.4614 1.5917 1.4363 1.4439 3.4605 1.6755 1.2467 2.1313 1.7860 3.5470 1.2968 1.6276 1.6944 1.4670 2.5445 1.2413 2.0918 1.8004 1.2461 2.5947 1.3266 6.3351 1.2114 1.1937 3.8316 1.1191 1.2174 1.0493 2.4961 1.6974 6.3211 5.7663 1.4704 2.9608 4.7407 1.0571 1.0355 1.1045 1.1015 1.0605 1.0974 1.0950 1.0891 1.0909 1.0934 1.1145 1.0807 1.0448 1.1042
irintensity: 0.1986 8.7249 0.0563 1.4407 1.2093 1.8497 0.6902 1.0874 7.5956 0.0249 4.3013 1.0384 7.9712 234.3660 7.0987 21.2912 78.6632 6.3787 1.7183 0.7208 2.7510 19.5968 4.5418 10.1537 0.3840 0.3408 83.3111 19.7299 31.0446 14.0712 56.7360 16.7673 6.2469 5.1023 19.6486 143.2236 80.4162 12.9600 14.1357 9.3555 16.3414 21.0689 0.1162 6.4551 45.0008 27.7527 188.6096 2.0469 57.9864 35.0321 1.9412 50.4015 4.9175 26.4756 24.8094 38.8230 25.4615 66.2487 63.7183 16.6720 176.9452 189.2707 93.8292 201.7799 72.8378 133.5195 2.7574 43.2017 88.5209 28.1625 42.2975 9.7385 3.6774 8.6901 21.3718 11.8484 19.1887 21.9476 180.1529 75.7105 21.1943
temp: 298.150 k
press: 1.00000 atm
elementType: 8 8 7 7 6 6 6 6 6 6 6 6 6 6 6 1 1 1 1 1 1 1 1 1 1 1 1 1 1
symmnumber: 1
zpe: 611756.0 jmol-1
zpe.correction: 0.233006 hartree
zpe.thermalcorrener: 0.248745 hartree
zpe.thermalcorrenthalpy: 0.249689 hartree
zpe.thermalcorrgfe: 0.189183 hartree
zpe.sumelectzpe: -686.392428 hartree
zpe.sumelectthermal: -686.376689 hartree
zpe.sumelectthermalent: -686.375744 hartree
zpe.sumelectthermalfe: -686.436251 hartree
dipole: 1.7165 -4.7237 -0.0427
dipole: 5.0261
quadrupole: -63.2940 -87.4473 -92.5120
quadrupole: 10.3581 -0.4702 -1.0412
quadrupole: 17.7904 -6.3628 -11.4276 10.3581 -0.4702 -1.0412
hfenergy: -686.6254338 hartree
pointgroup: C01 [X(C11H14N2O2)]
dipole: -0.4587926 -1.9231089 0.036114 debye
polarizability: 213.5898006|-1.9294143|155.9275526|9.9272005|3.8270929|75.3064784 unknown
InChI: InChI=1S/C11H14N2O2/c1-3-6-15-10-5-4-8(12)7-9(10)11(14)13-2/h3-5,7,13H,1,6,12H2,2H3
charge 0 multiplicity 1
29 atoms
O  -1.325464 -0.599508 -0.068149
O  0.920339 3.036136 -0.128392
N  -1.195107 2.067346 -0.215177
N  4.349965 -0.605341 -0.036027
C  0.798348 0.608268 -0.09375
C  0.0972 -0.636785 -0.063336
C  2.210671 0.583288 -0.082697
C  2.952212 -0.625808 -0.046545
C  0.821405 -1.850096 -0.033666
C  2.230668 -1.850554 -0.025375
C  0.181502 1.994671 -0.143282
C  -2.057609 -1.879526 0.027511
C  -1.89743 3.349817 -0.282559
C  -3.521246 -1.555181 0.166451
C  -4.48352 -2.041407 -0.654774
H  2.709218 1.559786 -0.103169
H  0.301022 -2.811945 -0.022875
H  2.769146 -2.805771 -0.003454
H  -1.864448 -2.492814 -0.875029
H  -1.693226 -2.4285 0.921847
H  -1.713946 1.180745 -0.218319
H  4.885916 -1.466696 -0.00525
H  4.852605 0.276581 -0.051002
H  -2.560804 3.491617 0.592115
H  -2.507089 3.422509 -1.203066
H  -1.140804 4.150502 -0.288808
H  -3.78606 -0.904296 1.011003
H  -5.542445 -1.811223 -0.495215
H  -4.241419 -2.685414 -1.509311
