program: Gaussian 09
title: 000207746
version: EM64L-G09RevD.01
frameworkgroup: C1[X(C13H18N2O2)]
method: RPBEPBE
basis: SDD
operation: Freq
keyword: #p
keyword: freq=noraman
keyword: PBEPBE/SDD
title: #p freq=noraman PBEPBE/SDD
converged: YES YES NO NO
title: Mulliken charges:
elementType: O O N N C C C C C C C C C C C C C H H H H H H H H H H H H H H H H H H
charge: -0.348744 -0.308478 -0.396243 -0.709669 -0.375965 0.112225 -0.344414 0.281170 0.153656 -0.555859 0.549791 -0.321239 -0.689916 -0.449144 -0.330486 -0.068251 -0.548730 0.251210 0.201328 0.197573 0.229410 0.371677 0.276734 0.237561 0.202235 0.220356 0.216252 0.217968 0.217247 0.215472 0.302335 0.312187 0.233360 0.225380 0.222009
chargesum: 0.00000
title: Mulliken charges with hydrogens summed into heavy atoms:
elementType: O O N N C C C C C C C C C C C C C
charge: -0.348744 -0.308478 -0.024565 -0.095148 0.076573 0.112225 0.082570 0.281170 0.153656 -0.279125 0.549791 -0.083678 -0.051073 -0.231176 0.102233 0.165109 -0.101340
polarizability: 2.33848859e+02 -1.27817172e+01 1.83227371e+02 1.18527052e+01 -2.18769185e+00 9.54176663e+01
1716.lowfreq: -5.1638 -0.0005 -0.0004 -0.0002 2.5489 4.5637 23.2626 34.0129 47.7164
frequency: 23.0365 33.9920 47.6537 57.4886 63.8027 95.1313 103.0635 119.1142 142.0649 171.0857 182.6911 233.2008 253.2775 270.1291 301.8713 309.5510 325.2997 358.6474 361.0440 366.3732 391.4277 430.1364 445.1075 482.2659 495.1991 563.3865 587.9101 630.6816 662.0172 689.3594 728.0410 744.6975 757.8649 768.7147 783.3372 797.8405 866.1422 882.6002 907.7118 921.8930 933.5185 935.0661 963.9195 974.9911 986.1834 989.9352 1010.8295 1037.7278 1058.5514 1095.5995 1116.0832 1141.8833 1148.1667 1168.0998 1187.6043 1221.5457 1250.8313 1255.5869 1262.7153 1282.4901 1284.7891 1328.0471 1337.0748 1346.7525 1357.2262 1388.1123 1389.5702 1433.8932 1435.5149 1451.6663 1463.1606 1471.5505 1477.5214 1486.4950 1490.8347 1531.9271 1580.2707 1590.9843 1635.3351 1648.2436 1666.0426 2947.6891 2969.2404 2983.9835 2989.8466 3017.9778 3039.7793 3067.0765 3071.6979 3075.1814 3093.0648 3115.1700 3124.8884 3133.9157 3162.4272 3203.8369 3434.4108 3572.1811 3713.3383
redmass: 3.3613 4.8984 4.7018 2.9898 4.2332 2.1752 2.4158 3.2567 3.1507 3.2243 4.2719 1.3644 3.1050 4.2318 3.6733 3.3959 1.1827 1.7430 1.9980 2.4794 4.0179 2.8465 2.8579 2.9508 3.2722 3.6049 4.4835 1.7430 5.6554 4.0752 1.1281 2.1878 4.8061 3.0304 2.3465 1.5498 2.1022 2.5157 1.4539 1.6074 1.4352 2.0738 1.4087 3.6511 1.6290 1.8391 1.2667 1.4607 2.6045 2.4734 2.4248 2.0420 1.6648 1.4530 2.6019 1.2308 1.3707 1.8711 1.6718 1.2458 1.2366 2.4961 1.3831 1.3282 1.2772 1.2759 5.2691 1.2163 3.4498 1.1505 1.0769 1.2103 1.0510 1.1902 2.0279 1.8436 5.8789 5.7038 1.5229 2.7724 4.7266 1.0573 1.0357 1.0620 1.0644 1.1043 1.0978 1.0992 1.0994 1.1007 1.0605 1.0949 1.0890 1.0909 1.0936 1.1145 1.0807 1.0448 1.1042
irintensity: 0.3135 0.1842 5.4799 1.5461 2.3851 0.5168 0.6465 1.9617 0.7518 5.9006 0.4419 0.6788 3.5376 9.9920 2.7255 2.4647 243.0845 19.5131 61.5247 5.2991 6.0306 1.3756 0.8082 4.8532 2.4855 15.5357 5.5158 10.5949 0.9213 0.7297 86.3665 2.7657 7.8816 62.4035 6.1469 54.5684 13.2661 6.1001 6.5358 7.1961 19.1962 1.2239 132.6294 81.5735 16.3278 8.2603 16.7728 11.4450 18.0370 7.7426 14.3885 5.8736 1.7732 18.5598 164.3595 2.1790 35.7849 43.9663 23.8496 53.9154 0.4465 54.8112 2.0536 3.8392 1.5150 14.6286 29.5372 38.6971 23.0893 21.7673 6.8293 55.5504 10.5192 73.3281 156.7652 259.7931 122.6129 168.7878 62.3103 146.8449 2.9218 42.7242 34.5267 31.6414 56.0652 28.4675 4.5695 60.4206 66.2405 30.8596 10.5167 9.1337 21.2381 12.5303 19.3161 21.0088 167.4863 76.6999 21.0455
temp: 298.150 k
press: 1.00000 atm
elementType: 8 8 7 7 6 6 6 6 6 6 6 6 6 6 6 6 6 1 1 1 1 1 1 1 1 1 1 1 1 1 1 1 1 1 1
symmnumber: 1
zpe: 758952.2 jmol-1
zpe.correction: 0.289070 hartree
zpe.thermalcorrener: 0.307372 hartree
zpe.thermalcorrenthalpy: 0.308316 hartree
zpe.thermalcorrgfe: 0.241136 hartree
zpe.sumelectzpe: -764.841357 hartree
zpe.sumelectthermal: -764.823055 hartree
zpe.sumelectthermalent: -764.822111 hartree
zpe.sumelectthermalfe: -764.889291 hartree
dipole: 0.5315 4.8042 0.6744
dipole: 4.8803
quadrupole: -72.8206 -100.6165 -105.7717
quadrupole: 0.1067 2.9595 -1.5499
quadrupole: 20.2490 -7.5469 -12.7021 0.1067 2.9595 -1.5499
hfenergy: -765.1304269 hartree
pointgroup: C01 [X(C13H18N2O2)]
dipole: -0.7579807 1.7214228 0.3857783 debye
polarizability: 220.1714409|16.0056167|175.6328051|25.8100325|39.9742669|116.6896504 unknown
InChI: InChI=1S/C13H18N2O2/c1-3-7-15-13(16)11-9-10(14)5-6-12(11)17-8-4-2/h4-6,9,15H,2-3,7-8,14H2,1H3
charge 0 multiplicity 1
35 atoms
O  0.104602 0.874667 0.88628
O  0.4765 -3.152424 -0.484359
N  1.53913 -1.353135 0.539011
N  -4.380744 -2.042315 -1.007512
C  2.854537 -2.006535 0.564395
C  -0.86797 -1.183197 -0.001799
C  3.763985 -1.59106 -0.619768
C  -1.040812 0.172265 0.417241
C  0.431639 -1.96852 -0.006613
C  -1.997174 -1.890464 -0.470515
C  -3.28886 -1.307218 -0.536282
C  -2.321739 0.766656 0.360718
C  4.09407 -0.083031 -0.639868
C  -3.434874 0.040759 -0.108478
C  -0.033931 2.312884 1.195138
C  1.344583 2.850881 1.473619
C  1.679245 3.524667 2.600854
H  2.681026 -3.096121 0.532249
H  3.351525 -1.75688 1.522572
H  4.701629 -2.178881 -0.554758
H  3.265769 -1.883864 -1.56309
H  1.423435 -0.391327 0.880457
H  -1.8189 -2.924281 -0.790021
H  -2.474693 1.799493 0.686826
H  4.600279 0.227483 0.294901
H  4.760921 0.168836 -1.484505
H  3.173135 0.52052 -0.748675
H  -4.41847 0.524807 -0.14108
H  -0.48217 2.820146 0.314261
H  -0.702492 2.449669 2.068139
H  -5.307171 -1.630587 -1.056115
H  -4.262724 -3.004354 -1.309557
H  2.087194 2.690292 0.679624
H  2.684904 3.933714 2.7455
H  0.957818 3.689256 3.410911
