program: Gaussian 09
title: 000207744
version: EM64L-G09RevD.01
frameworkgroup: C1[X(C12H16N2O2)]
method: RPBEPBE
basis: SDD
operation: Freq
keyword: #p
keyword: freq=noraman
keyword: PBEPBE/SDD
title: #p freq=noraman PBEPBE/SDD
converged: YES YES NO NO
title: Mulliken charges:
elementType: O O N N C C C C C C C C C C C C H H H H H H H H H H H H H H H H
charge: -0.277638 -0.293687 -0.112222 -0.710526 0.176561 0.231454 0.135986 -0.579349 0.537279 -0.325663 -0.444420 -0.617347 -0.603869 -0.342178 -0.069909 -0.557640 0.252544 0.239903 0.216361 0.217753 0.279446 0.222196 0.251418 0.213274 0.244359 0.204863 0.217263 0.302001 0.308342 0.241998 0.223101 0.218345
chargesum: 0.00000
title: Mulliken charges with hydrogens summed into heavy atoms:
elementType: O O N N C C C C C C C C C C C C
charge: -0.277638 -0.293687 -0.112222 -0.100183 0.176561 0.231454 0.135986 -0.326805 0.537279 -0.085761 -0.228060 0.102048 0.105184 0.079948 0.172090 -0.116194
polarizability: 2.13518338e+02 6.67601904e+00 1.59447332e+02 1.03177910e+01 -9.93608896e+00 9.82008611e+01
1716.lowfreq: -8.4454 -6.2541 -0.0005 -0.0004 0.0004 4.4259 28.7291 49.5186 54.2424
frequency: 28.6895 49.5073 54.2360 73.7383 98.0217 116.1406 116.9830 133.3074 155.3887 171.2875 182.3358 242.1254 260.3561 275.2638 301.4640 323.9879 343.1277 346.9030 357.7952 381.6552 405.5966 421.6172 476.0658 493.2434 533.1006 599.8163 626.4621 646.7611 689.6610 703.1504 745.5296 777.6020 797.8002 853.5785 882.3296 912.0423 919.9220 953.9480 955.4289 975.3565 983.8647 1014.6172 1036.0833 1052.3309 1057.7640 1094.3578 1140.9529 1145.1359 1147.3296 1193.4442 1205.4253 1217.2501 1246.8291 1269.3216 1280.8564 1326.8205 1341.6077 1375.4536 1390.9318 1408.1645 1432.1636 1435.3120 1444.6523 1464.7501 1469.7104 1471.1861 1488.1039 1491.6630 1501.5021 1563.1241 1584.2570 1632.7347 1645.3441 1665.5955 2934.2068 2962.6471 2971.2007 2999.5552 3037.5611 3045.1972 3091.6617 3112.8133 3114.6481 3123.4366 3124.2501 3136.9657 3160.7974 3202.1490 3571.7739 3712.2684
redmass: 4.3880 5.2846 3.3022 2.5184 3.7042 2.5469 2.9974 1.2872 3.0685 1.2694 2.9447 3.6072 3.1511 3.0312 4.1823 1.1896 1.1060 3.2644 5.3259 4.0038 2.6573 2.7689 2.9452 3.4129 5.1401 3.9685 1.6842 5.3794 5.1739 6.2828 3.8334 5.2963 1.5249 4.8943 1.8275 1.3564 1.6732 2.6326 1.3972 3.8693 1.6117 1.2598 1.4635 1.4883 2.2197 1.2237 1.5436 1.4185 1.6446 1.8540 2.6030 1.2921 5.9053 1.5448 1.2418 2.6179 1.3901 3.4396 3.7070 1.2009 1.2050 1.5099 2.2523 1.0594 1.1311 1.0828 1.0570 1.7580 1.8077 5.5396 7.4689 2.0776 1.8469 4.7815 1.0567 1.0357 1.0363 1.1038 1.1014 1.1016 1.0608 1.0970 1.0970 1.0944 1.0890 1.0915 1.0939 1.1142 1.0448 1.1040
irintensity: 2.0644 5.4772 0.9143 1.1507 5.8082 0.2205 1.6046 0.0652 0.3126 0.7739 1.9182 2.5992 2.8653 6.0370 2.8167 255.5157 56.6687 7.9143 6.7452 4.9786 2.9847 5.0622 0.4510 10.0803 5.6424 4.3772 9.6285 8.8355 2.1427 6.2286 13.1456 24.3111 46.8322 9.0153 24.1118 0.0170 6.9339 19.2719 106.1406 99.5386 10.3804 16.0576 28.8048 17.9012 31.9459 0.5224 41.6636 14.9491 0.0218 71.1488 222.3355 3.3907 39.5147 0.6141 0.9277 20.4627 20.8809 58.9940 35.9913 41.6577 45.9157 7.8842 88.7457 22.2965 41.3525 16.1393 21.9292 123.4605 80.3344 306.1133 14.3490 9.8215 194.7893 3.7484 45.2742 47.8282 99.0958 34.5724 47.4923 25.8004 9.8381 14.4479 1.8900 9.8276 19.1508 12.2302 16.4513 24.1364 72.4836 19.9271
temp: 298.150 k
press: 1.00000 atm
elementType: 8 8 7 7 6 6 6 6 6 6 6 6 6 6 6 6 1 1 1 1 1 1 1 1 1 1 1 1 1 1 1 1
symmnumber: 1
zpe: 681279.9 jmol-1
zpe.correction: 0.259486 hartree
zpe.thermalcorrener: 0.276938 hartree
zpe.thermalcorrenthalpy: 0.277882 hartree
zpe.thermalcorrgfe: 0.213684 hartree
zpe.sumelectzpe: -725.596192 hartree
zpe.sumelectthermal: -725.578740 hartree
zpe.sumelectthermalent: -725.577796 hartree
zpe.sumelectthermalfe: -725.641994 hartree
dipole: 0.1022 -2.9652 3.2056
dipole: 4.3679
quadrupole: -70.7703 -87.3135 -101.9766
quadrupole: 5.9287 -2.0464 6.0357
quadrupole: 15.9165 -0.6267 -15.2898 5.9287 -2.0464 6.0357
hfenergy: -725.8556778 hartree
pointgroup: C01 [X(C12H16N2O2)]
dipole: -0.2425309 0.9946871 -1.3802037 debye
polarizability: 212.8196185|0.9317581|155.1318886|-15.0181019|-18.6036026|103.2150239 unknown
InChI: InChI=1S/C12H16N2O2/c1-4-7-16-11-6-5-9(13)8-10(11)12(15)14(2)3/h4-6,8H,1,7,13H2,2-3H3
charge 0 multiplicity 1
32 atoms
O  1.137426 0.761428 -0.172762
O  -0.182645 -2.384724 1.638236
N  1.004276 -2.289626 -0.36397
N  -4.488955 0.076266 -0.104095
C  -0.81221 -0.636987 0.094085
C  -0.273229 0.649126 -0.1952
C  0.036328 -1.819613 0.514358
C  -2.212733 -0.801915 0.139173
C  -3.103296 0.270745 -0.139229
C  -1.147418 1.727645 -0.467168
C  -2.545096 1.541005 -0.447623
C  1.898267 -3.37196 0.076073
C  1.224957 -1.782671 -1.724834
C  1.705806 2.121648 -0.243448
C  3.187746 1.998037 -0.00643
C  4.132681 2.555161 -0.802462
H  -2.606244 -1.785457 0.420472
H  -0.754222 2.722805 -0.694834
H  -3.205251 2.390168 -0.662202
H  1.775497 -4.267157 -0.564263
H  1.640055 -3.632114 1.113852
H  2.954464 -3.043448 0.025455
H  0.373276 -1.165566 -2.047374
H  1.32466 -2.637284 -2.421999
H  2.140631 -1.164619 -1.778543
H  1.497586 2.582274 -1.231131
H  1.232726 2.746336 0.545736
H  -5.127203 0.849819 -0.260874
H  -4.878606 -0.822092 0.163818
H  3.47286 1.432224 0.890638
H  5.199359 2.473041 -0.56781
H  3.868005 3.113204 -1.709442
