program: Gaussian 09
title: 000207734
version: EM64L-G09RevD.01
frameworkgroup: C1[X(C14H12FNO3)]
method: RPBEPBE
basis: SDD
operation: Freq
keyword: #p
keyword: freq=noraman
keyword: PBEPBE/SDD
title: #p freq=noraman PBEPBE/SDD
converged: YES YES NO NO
title: Mulliken charges:
elementType: F O O O N C C C C C C C C C C C C C C H H H H H H H H H H H H
charge: -0.201718 -0.250492 -0.185790 -0.184966 -0.312380 -0.275063 -0.281468 -0.112004 -0.114737 -0.460507 -0.457390 0.102386 0.109804 0.502767 -0.308224 -0.308792 -0.369961 -0.373640 0.329662 0.295977 0.298201 0.262748 0.262528 0.245338 0.240405 0.229632 0.246176 0.276573 0.273902 0.260687 0.260348
chargesum: 0.00000
title: Mulliken charges with hydrogens summed into heavy atoms:
elementType: F O O O N C C C C C C C C C C C C C C
charge: -0.201718 -0.250492 -0.185790 -0.184966 -0.312380 0.020914 0.016732 0.150744 0.147791 0.025237 0.018417 0.102386 0.109804 0.502767 -0.031651 -0.034890 -0.109274 -0.113293 0.329662
polarizability: 2.09916889e+02 1.17972662e+00 1.54341142e+02 8.20879180e+00 -4.73181298e+00 1.04049067e+02
1716.lowfreq: -10.7935 -0.0011 -0.0011 -0.0008 2.7584 7.1976 36.7467 45.3690 67.4183
frequency: 36.7039 45.3251 67.3797 76.6393 141.4610 150.1593 186.7328 215.9543 255.5430 286.3846 318.5785 361.3729 380.6698 410.9620 413.5496 458.7057 472.1090 509.4644 520.8768 567.4740 577.6252 612.4186 626.7724 652.4184 702.4337 710.7011 727.7983 763.3658 783.6437 798.5491 801.0785 804.5969 828.0490 832.1110 843.3112 895.0250 902.1282 935.6039 947.8922 948.6570 977.7879 998.3881 999.0886 1008.0041 1023.8089 1050.5105 1059.3379 1113.3976 1116.1304 1144.1453 1159.9499 1163.3041 1174.2661 1188.0784 1197.0455 1207.2766 1213.9252 1228.3274 1255.1804 1262.6894 1275.2655 1288.4556 1292.7112 1301.3952 1315.8166 1327.8976 1381.2892 1414.8076 1465.3924 1483.8283 1497.3472 1601.2349 1614.2363 1626.9640 1685.7220 3027.2524 3039.1592 3059.0804 3071.7084 3084.3774 3104.8243 3134.5268 3141.6339 3173.6209 3174.4390 3196.7392 3200.8663
redmass: 6.9169 3.7926 4.6821 9.9478 7.1139 7.2055 3.3019 7.2176 9.2772 2.8333 9.0251 6.2550 6.8338 2.9676 5.2895 4.4702 4.6123 7.3169 2.8711 9.9727 4.9374 6.3639 6.8194 5.5713 4.8153 5.3283 5.4205 5.4856 2.8834 4.5912 3.8528 1.2774 2.3843 1.8637 1.6537 2.9433 5.8666 1.3824 5.8527 1.3634 3.3944 2.5591 2.2472 2.5161 2.4163 2.2717 2.5789 1.0967 1.3740 3.8686 1.5813 1.8122 2.6600 1.2091 1.3663 1.9062 1.6600 1.3677 1.5030 1.4480 1.3850 1.4908 1.5649 1.2870 1.5546 5.2417 8.9841 3.4110 1.0812 1.0975 2.5954 7.8998 6.3598 12.1516 12.6175 1.0595 1.0627 1.0856 1.0863 1.1050 1.1048 1.0895 1.0951 1.0902 1.0906 1.0960 1.0966
irintensity: 0.2193 0.1379 0.5865 1.0985 1.5821 8.6914 0.5618 2.9331 3.8694 1.0297 1.6501 3.2367 3.1943 0.0789 6.7173 4.9336 9.7254 27.4912 15.4454 15.1550 15.5249 2.1982 0.6619 3.3290 1.6126 1.6009 10.2386 1.2270 32.0042 24.0656 34.2105 1.5864 23.3655 49.5166 10.8510 14.1640 17.6342 3.7187 11.7289 0.1844 2.1523 3.4455 4.4398 11.6089 0.8658 31.8867 26.4095 0.7437 4.6311 194.6216 52.9441 23.1170 73.5308 0.6289 1.9877 39.7959 45.9111 1.3146 0.4846 46.6007 0.7794 1.9498 5.9439 2.8288 26.0984 140.2952 0.5745 4.1520 9.8832 13.6495 217.3562 39.7683 11.8422 404.0870 6.5913 19.2189 21.7807 2.2387 6.7051 0.5850 40.8171 23.8013 12.9303 2.9566 2.3194 0.4533 0.1918
temp: 298.150 k
press: 1.00000 atm
elementType: 9 8 8 8 7 6 6 6 6 6 6 6 6 6 6 6 6 6 6 1 1 1 1 1 1 1 1 1 1 1 1
symmnumber: 1
zpe: 616623.9 jmol-1
zpe.correction: 0.234860 hartree
zpe.thermalcorrener: 0.249465 hartree
zpe.thermalcorrenthalpy: 0.250409 hartree
zpe.thermalcorrgfe: 0.192315 hartree
zpe.sumelectzpe: -919.607589 hartree
zpe.sumelectthermal: -919.592983 hartree
zpe.sumelectthermalent: -919.592039 hartree
zpe.sumelectthermalfe: -919.650134 hartree
dipole: -2.0206 -0.0592 0.3979
dipole: 2.0602
quadrupole: -122.4531 -112.5073 -105.6234
quadrupole: 1.7337 -2.1671 -8.1303
quadrupole: -8.9252 1.0206 7.9045 1.7337 -2.1671 -8.1303
hfenergy: -919.8424485 hartree
pointgroup: C01 [X(C14H12F1N1O3)]
dipole: -0.7955084 -0.0141897 0.1548135 debye
polarizability: 209.8396085|2.0280171|153.355023|8.5282037|-8.4287507|105.1124666 unknown
InChI: InChI=1S/C14H12FNO3/c15-7-1-3-8(4-2-7)16-13(17)11-9-5-6-10(19-9)12(11)14(16)18/h1-4,9-12H,5-6H2
charge 0 multiplicity 1
31 atoms
F  5.557892 -0.120038 0.622962
O  -4.218933 0.010092 0.025793
O  -0.312591 2.432701 -0.112187
O  -0.316064 -2.196551 -1.029696
N  0.031903 0.101245 -0.487148
C  -2.198503 0.948506 -0.749285
C  -2.201113 -0.578885 -1.046741
C  -3.229839 1.055971 0.433026
C  -3.235769 -1.116876 0.008904
C  -2.643887 0.471936 1.747118
C  -2.652544 -1.072722 1.447336
C  -0.755219 1.300743 -0.413838
C  -0.758149 -1.035684 -0.872732
C  1.445831 0.044493 -0.20374
C  2.284355 1.126102 -0.574484
C  1.991491 -1.093409 0.443031
C  3.665115 1.07536 -0.294447
C  3.372658 -1.153251 0.718648
C  4.178624 -0.064889 0.345361
H  -2.542286 1.563339 -1.5965
H  -2.544584 -0.831895 -2.062474
H  -3.740666 2.022995 0.512844
H  -3.751415 -2.040226 -0.281352
H  -3.306681 0.71683 2.592371
H  -1.640326 0.866474 1.978707
H  -1.654354 -1.536964 1.519147
H  -3.323863 -1.608291 2.137466
H  1.862957 2.006672 -1.062303
H  1.350514 -1.935061 0.711264
H  4.329965 1.899374 -0.567079
H  3.816482 -2.02249 1.211428
