program: Gaussian 09
title: 000207733
version: EM64L-G09RevD.01
frameworkgroup: C1[X(C14H12FNO3)]
method: RPBEPBE
basis: SDD
operation: Freq
keyword: #p
keyword: freq=noraman
keyword: PBEPBE/SDD
title: #p freq=noraman PBEPBE/SDD
converged: NO YES NO NO
title: Mulliken charges:
elementType: F O O O N C C C C C C C C C C C C C C H H H H H H H H H H H H
charge: -0.203798 -0.250417 -0.183285 -0.182820 -0.314884 -0.275856 -0.281876 -0.111751 -0.115129 -0.460216 -0.457959 0.109602 0.112981 0.537305 -0.489180 -0.363966 0.346785 -0.181949 -0.388783 0.296688 0.299043 0.263261 0.262802 0.245418 0.240509 0.230102 0.246140 0.299920 0.272650 0.237247 0.261417
chargesum: 0.00000
title: Mulliken charges with hydrogens summed into heavy atoms:
elementType: F O O O N C C C C C C C C C C C C C C
charge: -0.203798 -0.250417 -0.183285 -0.182820 -0.314884 0.020831 0.017167 0.151510 0.147673 0.025712 0.018283 0.109602 0.112981 0.537305 -0.189260 -0.091316 0.346785 0.055298 -0.127366
polarizability: 2.05889260e+02 -1.52698467e+00 1.57048910e+02 -1.07524698e+01 5.25205009e+00 1.04454450e+02
1716.lowfreq: -7.5933 -4.7371 0.0007 0.0008 0.0009 7.2763 31.5106 39.3508 68.0185
frequency: 31.4938 39.3096 67.9921 93.8592 144.9215 153.1744 190.4593 224.9102 257.6028 284.0434 291.0013 331.0330 367.9922 425.6245 444.0590 462.1626 475.3650 503.4538 527.3320 571.0694 584.1082 599.0255 642.5905 651.1592 678.1189 712.7002 721.8121 763.1069 783.8127 785.5090 801.8446 820.2663 829.8648 862.5873 867.7270 890.9303 898.8193 919.4339 948.5642 969.6292 987.7019 990.9913 997.5910 1010.0863 1025.5229 1051.0522 1058.1723 1087.7169 1112.8075 1129.3764 1142.0824 1167.9454 1179.7791 1188.6170 1196.3312 1201.4469 1216.3088 1228.5293 1255.0272 1262.6198 1274.4256 1287.0725 1291.1871 1293.1976 1315.2644 1327.3209 1388.5278 1444.2170 1469.3005 1479.7139 1484.4270 1594.3958 1618.0778 1631.1836 1688.9538 3027.6730 3039.1704 3059.0339 3071.6756 3083.9695 3104.2045 3134.1147 3141.3915 3154.3054 3183.6672 3198.2358 3205.8587
redmass: 6.5090 5.7231 4.7673 6.9111 8.3583 5.9824 3.2440 5.7375 6.4864 5.9169 2.9575 7.3683 7.1372 5.0034 3.3476 4.2689 4.4317 8.6725 6.8396 5.2350 7.7380 6.5958 6.0881 5.4699 2.2650 5.7860 6.0862 5.0887 2.7714 1.5154 3.8207 2.4425 2.7356 2.2392 1.6134 1.4087 3.9956 3.5465 6.2791 1.3405 4.0646 2.9306 2.4911 2.5720 2.3395 2.2709 2.5804 1.5885 1.0962 1.9205 4.3955 1.5040 1.2313 1.2170 1.3723 2.6571 1.9159 1.3555 1.4955 1.4542 1.3994 1.5028 1.4328 1.5565 1.4953 4.0800 9.7784 3.2402 1.0812 2.5125 1.1111 6.8123 7.0061 12.1095 12.6205 1.0595 1.0628 1.0856 1.0863 1.1050 1.1047 1.0896 1.0950 1.0888 1.0950 1.0960 1.0936
irintensity: 0.1160 0.9986 0.6201 1.0808 3.1073 7.2559 1.6229 0.2271 1.8291 5.5129 1.2417 1.9866 2.2639 6.0347 7.6475 0.9332 1.3042 5.8039 21.7524 7.9993 9.4025 9.8191 0.0793 3.5554 22.1414 15.1319 19.0572 1.0974 25.4117 52.1244 23.2128 2.7064 1.1984 44.7252 26.8409 3.7193 11.1080 17.3475 9.6512 0.8298 0.7057 2.0580 3.7484 6.1136 1.6132 37.2892 27.9658 7.3550 0.7683 5.6470 195.2413 29.8316 17.0628 0.5888 1.0523 91.3128 93.9823 1.5535 0.6439 44.4577 0.7197 3.9157 10.4624 8.0187 18.2259 152.9194 0.1100 39.3900 10.7283 102.2966 16.6086 34.8657 71.3361 443.5249 10.5117 19.0902 21.8072 2.1090 6.4564 0.4729 40.7081 23.3655 12.7473 8.6557 3.2456 0.5053 3.3443
temp: 298.150 k
press: 1.00000 atm
elementType: 9 8 8 8 7 6 6 6 6 6 6 6 6 6 6 6 6 6 6 1 1 1 1 1 1 1 1 1 1 1 1
symmnumber: 1
zpe: 616667.4 jmol-1
zpe.correction: 0.234876 hartree
zpe.thermalcorrener: 0.249471 hartree
zpe.thermalcorrenthalpy: 0.250415 hartree
zpe.thermalcorrgfe: 0.192274 hartree
zpe.sumelectzpe: -919.607242 hartree
zpe.sumelectthermal: -919.592647 hartree
zpe.sumelectthermalent: -919.591703 hartree
zpe.sumelectthermalfe: -919.649844 hartree
dipole: 1.6003 1.6395 1.1106
dipole: 2.5460
quadrupole: -114.5019 -115.4069 -105.5130
quadrupole: -8.2019 -1.6929 7.7973
quadrupole: -2.6947 -3.5996 6.2943 -8.2019 -1.6929 7.7973
hfenergy: -919.8421184 hartree
pointgroup: C01 [X(C14H12F1N1O3)]
dipole: -0.6186613 -0.621299 0.4843829 debye
polarizability: 206.0704095|-0.2981474|156.0924366|10.1202714|-8.6126927|105.2297739 unknown
InChI: InChI=1S/C14H12FNO3/c15-7-2-1-3-8(6-7)16-13(17)11-9-4-5-10(19-9)12(11)14(16)18/h1-3,6,9-12H,4-5H2
charge 0 multiplicity 1
31 atoms
F  4.7144 1.574328 -0.335778
O  -4.150774 0.280751 -0.091618
O  -0.032269 2.325939 -0.013572
O  -0.431627 -2.262699 -1.043537
N  0.106278 -0.020496 -0.423802
C  -2.020364 1.040344 -0.761098
C  -2.153555 -0.474623 -1.092891
C  -3.088845 1.225129 0.377447
C  -3.275017 -0.93185 -0.089453
C  -2.620756 0.569534 1.704145
C  -2.751183 -0.96304 1.371909
C  -0.566844 1.247836 -0.356947
C  -0.768563 -1.069814 -0.873307
C  1.494021 -0.216974 -0.085137
C  2.436449 0.796991 -0.386201
C  1.907146 -1.41992 0.541751
C  3.775271 0.566036 -0.039549
C  3.268039 -1.607543 0.862611
C  4.228348 -0.610995 0.577736
H  -2.265046 1.700667 -1.608557
H  -2.478848 -0.676359 -2.125826
H  -3.512847 2.233622 0.452706
H  -3.860869 -1.798911 -0.41772
H  -3.301121 0.858121 2.521233
H  -1.599664 0.869285 1.994254
H  -1.801185 -1.514378 1.475406
H  -3.494559 -1.449541 2.023407
H  2.144718 1.738357 -0.853888
H  1.18075 -2.205944 0.754852
H  3.583775 -2.539577 1.341529
H  5.286641 -0.734874 0.821794
