program: Gaussian 09
title: 000207709
version: EM64L-G09RevD.01
frameworkgroup: C1[X(C14H16N2O3)]
method: RPBEPBE
basis: SDD
operation: Freq
keyword: #p
keyword: freq=noraman
keyword: PBEPBE/SDD
title: #p freq=noraman PBEPBE/SDD
converged: YES YES NO NO
title: Mulliken charges:
elementType: O O O N N C C C C C C C C C C C C C C H H H H H H H H H H H H H H H H
charge: -0.244817 -0.297412 -0.292315 -0.128723 -0.707677 -0.358926 -0.373386 -0.300059 -0.299491 0.119012 0.228383 0.127180 -0.574118 0.540265 -0.297427 -0.428115 -0.405667 0.251052 -0.502336 0.249846 0.224451 0.227904 0.260561 0.220576 0.216107 0.207982 0.222365 0.236781 0.247299 0.220315 0.307447 0.308188 0.285246 0.233511 0.275998
chargesum: 0.00000
title: Mulliken charges with hydrogens summed into heavy atoms:
elementType: O O O N N C C C C C C C C C C C C C C
charge: -0.244817 -0.297412 -0.292315 -0.128723 -0.092042 0.115371 0.115080 0.136624 0.130856 0.119012 0.228383 0.127180 -0.337337 0.540265 -0.050128 -0.207800 0.113090 0.251052 -0.226337
polarizability: 2.08206778e+02 4.42834470e+00 1.87540647e+02 1.32109853e+01 -2.33017421e+00 1.24318793e+02
1716.lowfreq: -7.5910 -0.9228 0.0000 0.0003 0.0006 6.5296 10.1712 44.0280 51.7424
frequency: 7.5058 44.0256 51.5731 56.2768 65.3429 75.9432 105.1525 151.7298 179.1799 186.2197 218.9681 235.3317 290.3107 292.8740 318.1782 343.7171 348.7112 359.9824 363.2762 391.7780 405.2878 418.8135 450.8741 461.2008 462.5773 498.4223 567.4479 581.4935 618.8436 623.2669 633.3205 671.2698 679.3695 689.9431 735.9922 750.5879 790.7257 819.5128 831.6510 834.7522 868.2590 873.6571 903.1197 931.0697 939.5463 949.5176 998.3530 1006.6471 1008.6305 1035.2854 1046.2709 1069.2899 1071.6157 1115.0793 1147.5782 1176.8542 1183.6374 1192.2908 1230.9908 1236.5674 1253.1485 1262.8684 1272.8501 1323.9944 1328.5154 1340.0801 1341.0148 1349.7520 1365.4238 1372.6814 1412.0526 1439.3468 1445.6409 1447.7184 1455.4912 1457.8702 1459.8858 1487.5376 1552.3147 1579.2243 1625.4379 1645.0550 2135.2635 2959.3848 2963.5506 2990.7192 2992.3295 2999.7294 3073.1799 3084.1993 3086.5606 3089.6972 3095.0091 3121.0921 3127.8887 3168.4030 3424.5696 3569.0072 3708.9814
redmass: 6.3689 4.5481 4.1029 5.1942 4.9029 4.0636 3.9172 6.1253 3.3324 3.9361 4.2511 4.6105 3.4447 3.0057 2.7975 3.8884 3.2098 1.1148 1.2660 3.4423 2.2344 4.5415 4.6225 4.2624 3.1775 4.5792 4.2551 3.0248 1.2356 3.1885 4.0014 1.4751 3.5891 4.8925 6.6772 3.7425 4.3875 1.5408 1.9285 3.0344 1.8262 6.1616 2.5809 3.1347 2.3294 2.0017 2.6762 1.8035 2.3100 1.5323 2.5660 2.9516 2.5449 2.0608 1.4129 2.6472 2.1719 1.1457 1.4280 1.1973 1.4674 1.5931 1.2132 1.3428 2.1115 1.2145 1.2929 1.3726 1.4130 4.9583 2.8062 1.4505 1.4400 1.0827 1.1151 1.1562 1.4143 3.3633 8.4234 7.4575 4.2005 1.2783 6.0137 1.0672 1.0672 1.0619 1.0651 1.0629 1.1012 1.0962 1.0974 1.1020 1.0976 1.0912 1.0894 1.0952 1.1588 1.0450 1.1040
irintensity: 0.8830 0.1862 0.6238 3.2105 2.2557 0.3734 4.1475 2.8003 3.2382 7.4701 2.3027 5.7470 11.4055 1.4095 7.7974 28.9922 6.2678 67.0023 210.4522 8.3901 3.0931 1.7568 17.5479 5.8271 1.1144 16.4327 9.3989 10.7089 76.2783 4.0383 14.2945 57.3040 15.3916 0.3743 2.8598 3.2647 20.0423 30.8261 0.2583 7.0629 48.1186 55.7380 6.6690 10.7850 42.6901 31.2365 32.2021 0.7255 53.7676 1.5967 48.0599 21.7006 13.6687 6.2220 7.4951 4.6744 79.5094 2.7220 100.9012 9.9276 3.2966 50.7148 25.2716 6.2009 33.6728 8.9034 2.5301 5.7426 5.3304 4.8801 48.1759 64.2044 64.2122 1.0681 7.5989 3.3469 58.3774 136.6124 311.9250 15.7580 41.0552 230.3083 0.4993 33.2092 43.0342 31.7671 24.6581 59.5912 11.8018 41.1292 30.2005 14.1818 11.0176 10.8488 23.1548 6.9023 59.8048 75.5828 20.6997
temp: 298.150 k
press: 1.00000 atm
elementType: 8 8 8 7 7 6 6 6 6 6 6 6 6 6 6 6 6 6 6 1 1 1 1 1 1 1 1 1 1 1 1 1 1 1 1
symmnumber: 1
zpe: 726152.1 jmol-1
zpe.correction: 0.276577 hartree
zpe.thermalcorrener: 0.295071 hartree
zpe.thermalcorrenthalpy: 0.296015 hartree
zpe.thermalcorrgfe: 0.227965 hartree
zpe.sumelectzpe: -876.772626 hartree
zpe.sumelectthermal: -876.754131 hartree
zpe.sumelectthermalent: -876.753187 hartree
zpe.sumelectthermalfe: -876.821237 hartree
dipole: -1.7010 -4.1072 -0.5087
dipole: 4.4745
quadrupole: -100.5744 -93.1495 -118.4737
quadrupole: 7.7903 7.6744 -2.9065
quadrupole: 3.4915 10.9163 -14.4078 7.7903 7.6744 -2.9065
hfenergy: -877.0492024 hartree
pointgroup: C01 [X(C14H16N2O3)]
dipole: 1.444425 -0.7527058 0.6679397 debye
polarizability: 194.7563863|9.2275602|193.5023547|26.3431768|5.9672085|131.8074771 unknown
InChI: InChI=1S/C14H16N2O3/c1-2-7-19-13-4-3-11(15)10-12(13)14(17)16-5-8-18-9-6-16/h1,3-4,10H,5-9,15H2
charge 0 multiplicity 1
35 atoms
O  -3.522122 -2.505237 0.694523
O  -0.502107 -0.041805 -2.053017
O  -0.708088 1.756353 0.674887
N  -1.035656 -1.694353 -0.498635
N  4.283561 -0.899578 1.039753
C  -1.059369 -2.215435 0.886688
C  -2.131921 -2.214017 -1.34832
C  -2.441846 -1.928591 1.513999
C  -3.487726 -1.937721 -0.666952
C  -0.299499 -0.596961 -0.920936
C  0.778534 -0.087864 0.010666
C  0.567259 1.121844 0.720539
C  2.013533 -0.761667 0.125964
C  3.057915 -0.2371 0.93973
C  1.588845 1.640847 1.544519
C  2.822913 0.972825 1.656838
C  -0.897073 2.70807 -0.468336
C  -0.107607 3.941665 -0.330563
C  0.549606 4.979335 -0.218944
H  -0.261125 -1.741821 1.47957
H  -0.886218 -3.309226 0.86254
H  -1.994007 -3.304316 -1.48041
H  -2.071722 -1.711494 -2.32818
H  -2.534897 -2.408008 2.502336
H  -2.582524 -0.830839 1.61433
H  -3.667943 -0.842468 -0.622412
H  -4.31302 -2.427018 -1.209516
H  2.172268 -1.693976 -0.429984
H  1.399229 2.566894 2.095745
H  3.611005 1.386895 2.297261
H  5.037494 -0.513556 1.599701
H  4.46885 -1.738448 0.498489
H  -0.655012 2.181866 -1.412108
H  -1.976414 2.935442 -0.444453
H  1.124687 5.882959 -0.129814
