program: Gaussian 09
title: 000207704
version: EM64L-G09RevD.01
frameworkgroup: C1[X(C15H20N2O2)]
method: RPBEPBE
basis: SDD
operation: Freq
keyword: #p
keyword: freq=noraman
keyword: PBEPBE/SDD
title: #p freq=noraman PBEPBE/SDD
converged: YES YES NO NO
title: Mulliken charges:
elementType: O O N N C C C C C C C C C C C C C C C H H H H H H H H H H H H H H H H H H H H
charge: -0.331552 -0.298009 -0.392424 -0.705116 -0.022601 -0.374754 -0.408217 -0.716000 -0.710678 0.110321 0.163964 0.211451 -0.570315 0.546501 -0.326968 -0.420811 -0.367606 0.207567 -0.461085 0.198534 0.216457 0.194911 0.226161 0.259003 0.212218 0.211434 0.213233 0.220367 0.207580 0.215092 0.359688 0.275994 0.241387 0.222269 0.306081 0.315198 0.242956 0.246955 0.280814
chargesum: 0.00000
title: Mulliken charges with hydrogens summed into heavy atoms:
elementType: O O N N C C C C C C C C C C C C C C C
charge: -0.331552 -0.298009 -0.032736 -0.083837 0.175933 0.036614 0.076947 -0.079116 -0.067638 0.110321 0.163964 0.211451 -0.294321 0.546501 -0.085581 -0.198542 0.122306 0.207567 -0.180271
polarizability: 2.60997316e+02 -3.19775294e+01 2.00886434e+02 -8.31842468e+00 9.62402507e+00 1.06961657e+02
1716.lowfreq: -14.3517 -6.7433 -0.0006 -0.0001 0.0002 3.8172 5.8886 21.5377 30.2901
frequency: -11.6746 21.2206 30.1872 33.3331 46.8630 63.0936 87.4202 96.7061 133.5342 149.0602 167.3230 175.4683 213.9756 218.0673 241.2892 271.0549 305.7917 314.5144 332.4594 347.3006 360.4537 362.8638 367.9164 388.0352 389.9747 416.9743 431.4024 457.8523 517.4386 538.4128 559.5961 585.3298 635.6183 664.9755 682.3179 697.7831 738.2578 750.7080 773.4195 785.1969 791.3690 813.1953 815.6768 880.8749 902.8857 914.4753 917.2765 940.0118 953.4081 955.8777 974.3495 978.5026 979.0826 999.2273 1026.0789 1042.6553 1091.2423 1127.8242 1149.1950 1156.7659 1167.3130 1191.4524 1195.5022 1228.3412 1242.4419 1253.2987 1283.6619 1298.2861 1326.4883 1333.9436 1337.3990 1347.1739 1367.6329 1378.0619 1385.0144 1395.7891 1436.5654 1455.2280 1461.0272 1465.5661 1473.0462 1477.8342 1481.8313 1485.2525 1490.3607 1526.4644 1576.0094 1593.4829 1631.7803 1645.6663 2151.1942 2952.8805 2965.8048 2967.4367 2969.6454 2975.1621 3002.1551 3022.7482 3024.6814 3061.3155 3064.3590 3069.4602 3071.8696 3083.4083 3125.2498 3135.6537 3152.2219 3398.4862 3425.3242 3568.1510 3708.7904
redmass: 3.0610 4.2291 4.0610 6.1394 2.9914 4.6825 4.0897 2.1058 4.3093 4.0783 4.5738 3.4077 3.5507 1.1913 1.0380 3.9658 3.2931 3.6713 5.2469 3.0431 2.2927 1.9320 1.6321 2.5118 1.4295 3.6450 4.2633 4.0663 4.2329 4.9822 3.3575 3.8517 1.2278 5.3815 1.2703 4.3986 1.8472 5.0263 4.1042 1.4713 2.5371 1.6847 1.6516 6.2144 2.6868 1.3665 1.5939 1.3780 1.4919 1.8889 3.7365 1.6593 2.1046 1.8841 1.8515 2.1717 2.8940 1.8307 1.5415 2.0801 2.2774 1.8996 1.0591 1.2477 1.6231 2.0736 1.5378 1.1646 2.3929 1.4550 1.3363 1.3518 1.3720 1.2125 6.8462 1.2194 3.9010 1.0929 1.0980 1.0458 1.1039 1.0739 3.3217 1.0553 1.0536 1.8206 6.3459 6.3597 2.8143 1.5179 6.0118 1.0730 1.0563 1.0450 1.0537 1.0437 1.0651 1.1049 1.0966 1.0998 1.0999 1.0990 1.0992 1.1007 1.0879 1.0910 1.0965 1.0808 1.1605 1.0450 1.1041
irintensity: 0.2534 0.0551 0.5852 4.5839 1.8630 2.9963 3.6747 0.2196 3.9201 1.5251 2.0894 5.8447 3.2111 0.6036 0.1036 2.6053 15.1871 8.2592 0.5404 6.6343 29.1419 51.4966 93.3661 19.4237 124.0377 3.0281 5.4700 3.4422 2.5725 10.7425 20.0901 16.7168 77.7157 0.5406 52.5097 6.6962 3.2935 6.5631 18.6898 35.5377 9.9791 63.5199 25.7965 97.0196 7.3336 0.9333 18.0841 7.8399 0.3617 1.3196 41.5636 2.9560 1.5039 3.7602 3.7167 10.1094 11.7897 3.4975 7.9930 6.5638 53.4342 8.2816 2.2361 4.2017 33.9653 71.7572 35.3741 12.6911 53.6392 5.4486 0.6940 29.5578 1.5074 24.7517 4.9148 15.5570 17.2660 16.2289 4.1791 2.0624 6.8792 9.6731 181.0691 13.1037 15.3847 256.5231 69.6973 224.6519 7.3957 242.9676 1.3804 15.4483 16.2567 44.4255 56.7972 7.2853 41.7897 16.0336 30.3691 13.7312 22.9389 112.1926 59.3426 10.8130 17.7774 9.9824 15.6331 153.9061 65.7999 87.5414 22.4769
temp: 298.150 k
press: 1.00000 atm
elementType: 8 8 7 7 6 6 6 6 6 6 6 6 6 6 6 6 6 6 6 1 1 1 1 1 1 1 1 1 1 1 1 1 1 1 1 1 1 1 1
symmnumber: 1
zpe: 840921.4 jmol-1
zpe.correction: 0.320290 hartree
zpe.thermalcorrener: 0.340316 hartree
zpe.thermalcorrenthalpy: 0.341260 hartree
zpe.thermalcorrgfe: 0.270201 hartree
zpe.sumelectzpe: -842.059218 hartree
zpe.sumelectthermal: -842.039192 hartree
zpe.sumelectthermalent: -842.038248 hartree
zpe.sumelectthermalfe: -842.109307 hartree
dipole: 2.2772 2.3706 -0.9972
dipole: 3.4351
quadrupole: -79.3629 -111.1248 -117.8256
quadrupole: -10.1820 -3.8494 -2.6451
quadrupole: 23.4082 -8.3537 -15.0545 -10.1820 -3.8494 -2.6451
hfenergy: -842.3795076 hartree
pointgroup: C01[X(C15H20N2O2)]
dipole: 0.882535 -0.948971 0.38343 debye
polarizability: 261.5417956|31.0707981|199.8403957|10.1849602|11.3494976|107.4632165 unknown
InChI: InChI=1S/C15H20N2O2/c1-4-9-19-14-6-5-12(16)10-13(14)15(18)17-8-7-11(2)3/h1,5-6,10-11,17H,7-9,16H2,2-3H3
charge 0 multiplicity 1
39 atoms
O  0.798842 -1.706745 -0.603421
O  0.012899 2.466401 0.210871
N  -0.84469 0.477556 -0.656113
N  5.035313 1.960504 0.2973
C  -4.605257 0.737025 0.38045
C  -3.10325 0.334863 0.413274
C  -2.236088 0.949488 -0.715122
C  -5.329179 0.212073 -0.884517
C  -4.809095 2.263706 0.544451
C  0.182926 1.262873 -0.176969
C  1.563492 0.626941 -0.160412
C  1.849631 -0.755216 -0.354408
C  2.644098 1.511473 0.054931
C  3.991094 1.061621 0.079431
C  3.182523 -1.21583 -0.342125
C  4.250429 -0.325246 -0.130165
C  0.416908 -2.473035 0.627213
C  -0.687116 -3.380066 0.305069
C  -1.624407 -4.142161 0.062508
H  -5.074967 0.243162 1.257871
H  -2.664917 0.642516 1.38342
H  -3.027333 -0.771586 0.359717
H  -2.653119 0.691792 -1.706709
H  -2.206594 2.048093 -0.624033
H  -4.966166 0.718484 -1.798473
H  -5.173974 -0.876017 -1.013424
H  -6.417881 0.395067 -0.817604
H  -4.277075 2.645708 1.435485
H  -5.882418 2.506846 0.655597
H  -4.433077 2.818864 -0.335096
H  -0.608139 -0.48557 -0.933782
H  2.392143 2.567406 0.208795
H  3.375897 -2.27942 -0.521174
H  5.281899 -0.697294 -0.13223
H  6.001357 1.648151 0.308627
H  4.845947 2.947956 0.440563
H  1.299622 -3.038489 0.984458
H  0.114001 -1.755243 1.416722
H  -2.436278 -4.81265 -0.154775
