program: Gaussian 09
title: 000207702
version: EM64L-G09RevD.01
frameworkgroup: C1[X(C14H18N2O2)]
method: RPBEPBE
basis: SDD
operation: Freq
keyword: #p
keyword: freq=noraman
keyword: PBEPBE/SDD
title: #p freq=noraman PBEPBE/SDD
converged: YES YES NO NO
title: Mulliken charges:
elementType: O O N N C C C C C C C C C C C C C C H H H H H H H H H H H H H H H H H H
charge: -0.309254 -0.332184 -0.457596 -0.705343 0.319817 -0.751021 -0.697940 -0.700070 0.138167 0.152486 0.208248 -0.567051 0.547457 -0.328103 -0.421073 -0.367930 0.211616 -0.464780 0.376094 0.220602 0.218072 0.226598 0.268464 0.208238 0.200783 0.202835 0.202785 0.269754 0.275921 0.241178 0.222181 0.305940 0.314967 0.246282 0.242943 0.280915
chargesum: 0.00000
title: Mulliken charges with hydrogens summed into heavy atoms:
elementType: O O N N C C C C C C C C C C C C C C
charge: -0.309254 -0.332184 -0.081502 -0.084436 0.319817 -0.085749 -0.020455 -0.024695 0.138167 0.152486 0.208248 -0.291130 0.547457 -0.086925 -0.198891 0.121295 0.211616 -0.183864
polarizability: 2.46794925e+02 -2.26233391e+01 1.84286255e+02 3.01552804e+00 -1.09913720e+01 1.02397994e+02
1716.lowfreq: -8.2803 0.0006 0.0008 0.0011 4.6275 6.2326 25.5959 37.5670 52.7191
frequency: 25.5847 37.5446 52.7056 60.8852 64.3178 106.7333 130.1954 149.8587 166.7187 193.8755 202.1878 219.7108 239.8175 257.9160 260.1007 305.6612 315.5877 336.0161 337.6570 358.4186 366.3769 388.2264 391.8731 409.4291 422.4959 434.8565 457.4933 478.6098 523.0531 546.6697 587.3778 636.3068 656.6653 681.6310 700.3901 741.1120 757.3883 769.4712 780.1172 811.2766 816.6731 881.9187 902.0846 915.2720 919.3138 926.2321 940.6283 947.4277 951.7895 974.9611 977.8678 1033.5759 1036.9402 1039.6685 1069.2585 1139.7304 1166.1312 1195.3638 1218.2794 1232.5326 1236.7388 1246.7205 1275.3064 1326.5371 1347.0026 1368.2477 1373.8033 1385.1131 1398.0060 1434.0587 1449.3828 1461.5616 1467.8457 1469.1655 1471.8265 1481.9729 1483.5908 1503.4411 1522.2765 1576.2207 1590.2656 1631.1317 1645.3696 2151.3279 2965.3966 2975.1624 2980.7085 2985.3616 3022.7001 3068.2394 3075.0549 3078.8639 3089.7921 3103.7035 3107.2191 3125.3163 3134.1770 3151.9531 3375.1105 3425.3472 3568.6758 3709.2420
redmass: 4.2495 3.9327 3.4862 3.1499 4.0158 3.9888 4.5831 4.1321 4.6304 1.0333 4.6644 3.3895 4.0099 1.1153 1.0558 3.2497 3.0939 3.0439 3.8287 1.5567 2.4120 3.7452 1.2230 2.7779 3.9745 3.8932 2.7015 3.4546 5.1348 5.6662 3.7896 1.2285 6.5949 1.2703 4.2857 4.9658 3.7402 1.4870 2.9802 3.0195 1.9500 6.4985 3.1698 1.6932 1.6061 1.6405 1.3760 2.6778 1.2054 3.7404 1.6770 1.3880 1.5580 1.4434 3.2549 1.3967 2.1807 1.0564 2.3498 3.0233 2.5062 1.5682 3.6198 2.6008 1.3470 1.2048 1.2087 6.7180 1.2220 3.8349 1.0474 1.0953 1.1023 1.0775 1.0485 3.3764 1.0560 1.0630 1.7673 6.0344 5.4260 2.8147 1.5125 6.0123 1.0564 1.0357 1.0353 1.0361 1.1046 1.1002 1.0999 1.0995 1.0986 1.1000 1.0995 1.0878 1.0909 1.0966 1.0804 1.1605 1.0450 1.1041
irintensity: 1.6279 1.2549 1.2237 2.7658 3.6060 7.2225 1.8872 0.3047 0.1635 0.2252 2.8977 15.0376 1.2710 0.5639 0.1662 7.8134 9.9214 0.4953 1.1646 121.8670 48.8578 7.1336 138.9405 1.0533 2.9500 8.2565 2.2955 1.5921 2.9483 16.1053 14.2110 72.9665 3.1738 53.9049 8.4459 12.4951 2.6120 57.6968 21.3329 30.8559 25.0917 95.7925 8.7854 0.6247 14.1101 4.4056 8.3351 1.2186 0.6947 43.6637 1.2465 0.0377 6.8153 0.2810 13.6774 21.8201 50.1981 1.8075 2.9812 21.7783 108.9138 1.9940 97.9165 50.7885 25.5127 32.9627 35.3958 5.1730 38.9601 12.8375 0.3451 2.7518 40.4173 39.3192 1.4445 177.4512 6.7779 27.4166 261.6306 58.0083 185.1272 8.0568 248.5798 1.4762 23.3435 18.3914 38.3588 34.2281 16.0375 12.7147 39.6995 28.4738 72.2492 2.1896 18.3203 17.4359 10.6454 15.8611 155.0620 68.1048 86.3986 22.3171
temp: 298.150 k
press: 1.00000 atm
elementType: 8 8 7 7 6 6 6 6 6 6 6 6 6 6 6 6 6 6 1 1 1 1 1 1 1 1 1 1 1 1 1 1 1 1 1 1
symmnumber: 1
zpe: 764933.5 jmol-1
zpe.correction: 0.291348 hartree
zpe.thermalcorrener: 0.310835 hartree
zpe.thermalcorrenthalpy: 0.311780 hartree
zpe.thermalcorrgfe: 0.243437 hartree
zpe.sumelectzpe: -802.841791 hartree
zpe.sumelectthermal: -802.822304 hartree
zpe.sumelectthermalent: -802.821360 hartree
zpe.sumelectthermalfe: -802.889703 hartree
dipole: 2.0899 2.6669 0.2781
dipole: 3.3997
quadrupole: -73.6730 -105.9784 -112.3648
quadrupole: -6.3448 1.6402 3.7584
quadrupole: 23.6657 -8.6397 -15.0261 -6.3448 1.6402 3.7584
hfenergy: -803.1331392 hartree
pointgroup: C01 [X(C14H18N2O2)]
dipole: 0.77633 -1.0891352 0.0085894 debye
polarizability: 248.4123964|18.9581746|178.7290457|-8.0908052|-20.3432488|106.3377324 unknown
InChI: InChI=1S/C14H18N2O2/c1-5-8-18-12-7-6-10(15)9-11(12)13(17)16-14(2,3)4/h1,6-7,9,16H,8,15H2,2-4H3
charge 0 multiplicity 1
36 atoms
O  -0.015584 2.412831 -0.879469
O  -0.081362 -1.584448 0.793391
N  -1.306473 0.797892 0.219149
N  4.802803 1.086292 -0.307667
C  -2.636001 1.470414 0.098563
C  -3.659937 0.539959 0.793198
C  -2.600299 2.84917 0.81092
C  -3.005267 1.646633 -1.398631
C  -0.118266 1.298115 -0.263693
C  1.121513 0.451598 -0.001953
C  1.139009 -0.886931 0.485307
C  2.358032 1.086488 -0.2567
C  3.599888 0.431857 -0.04178
C  2.364166 -1.546995 0.715088
C  3.588372 -0.903431 0.459303
C  -0.491195 -2.530467 -0.294253
C  -1.742987 -3.188828 0.086306
C  -2.801433 -3.74854 0.376825
H  -1.252266 -0.108688 0.707711
H  -3.419487 0.413916 1.865484
H  -4.671918 0.974386 0.717935
H  -3.678117 -0.459771 0.3195
H  -1.846355 3.501312 0.340915
H  -2.347965 2.726706 1.879937
H  -3.590326 3.336087 0.738385
H  -3.064938 0.664291 -1.902341
H  -3.987867 2.145231 -1.487738
H  -2.246031 2.262572 -1.90746
H  2.312259 2.114382 -0.635797
H  2.348244 -2.5663 1.117035
H  4.532622 -1.426527 0.651907
H  5.694557 0.628701 -0.145675
H  4.806543 2.03938 -0.658338
H  -0.620741 -1.958503 -1.235808
H  0.314738 -3.275303 -0.443098
H  -3.721134 -4.240078 0.638339
