program: Gaussian 09
title: 000207699
version: EM64L-G09RevD.01
frameworkgroup: C1[X(C13H16N2O2)]
method: RPBEPBE
basis: SDD
operation: Freq
keyword: #p
keyword: freq=noraman
keyword: PBEPBE/SDD
title: #p freq=noraman PBEPBE/SDD
converged: YES YES NO NO
title: Mulliken charges:
elementType: O O N N C C C C C C C C C C C C C H H H H H H H H H H H H H H H H
charge: -0.342155 -0.307856 -0.394373 -0.708724 -0.374365 -0.346553 0.115760 0.155395 0.280691 -0.554154 0.550628 -0.686014 -0.320189 -0.452578 -0.343726 0.177416 -0.451149 0.200811 0.249863 0.230255 0.196685 0.373077 0.278166 0.224208 0.217830 0.200255 0.234658 0.219386 0.303382 0.313414 0.239175 0.239363 0.281416
chargesum: 0.00000
title: Mulliken charges with hydrogens summed into heavy atoms:
elementType: O O N N C C C C C C C C C C C C C
charge: -0.342155 -0.307856 -0.021295 -0.091928 0.076309 0.080387 0.115760 0.155395 0.280691 -0.275988 0.550628 -0.043721 -0.085531 -0.233192 0.134812 0.177416 -0.169732
polarizability: 2.40998918e+02 1.61799470e+01 1.72474336e+02 -1.09665450e+01 4.53700994e+00 8.75677940e+01
1716.lowfreq: -4.0991 -0.0006 -0.0005 0.0003 2.1759 6.7063 17.4056 30.1799 46.3097
frequency: 16.7590 30.1549 46.2651 62.5007 74.9547 90.4911 103.7998 128.9476 166.5703 180.9959 204.4790 240.4231 268.0253 278.1897 317.9692 326.0877 334.5021 360.2017 362.6176 366.4038 393.4399 427.1650 436.9005 489.9708 527.2476 564.2956 588.0203 639.1680 661.6470 688.2607 688.8118 729.7526 746.2710 757.9183 766.9860 782.6336 793.4299 865.1844 882.2569 905.6189 932.7415 936.5454 945.9282 990.1407 992.0063 999.5556 1038.1701 1058.1043 1095.7973 1115.1762 1141.9888 1170.4105 1185.9734 1202.7726 1250.9375 1255.2888 1263.6258 1284.3097 1329.5662 1337.3203 1349.7419 1357.8281 1391.0851 1391.9923 1435.6282 1450.1067 1463.9707 1468.3925 1478.9897 1487.4148 1491.4366 1530.4955 1580.8280 1590.3448 1635.0468 1647.9600 2158.2623 2951.4033 2971.4389 2983.8849 2992.2069 3004.1335 3040.4795 3067.2866 3074.7625 3075.6298 3126.0053 3133.5549 3162.2949 3425.6537 3448.5056 3571.6897 3712.6733
redmass: 3.4627 5.3476 5.1829 4.6586 3.8399 2.6168 2.2341 4.3571 3.0106 4.4151 4.8602 1.3250 4.5112 3.8156 5.1017 2.7585 1.2448 3.1357 2.8153 1.2630 4.1536 4.3863 3.5143 2.5928 5.7472 3.6088 5.5266 1.2292 6.0535 1.2609 3.9536 1.1053 2.5020 4.9573 3.0631 2.3724 1.5516 2.1333 2.5110 1.4590 2.2889 1.4371 5.5025 1.8569 4.2251 1.5814 1.4597 2.6025 2.5135 2.4450 2.0465 1.4343 2.6038 1.0523 1.3084 2.1232 1.5894 1.2372 2.4244 1.3988 1.3829 1.2747 1.7341 2.4894 3.4779 1.1688 1.0761 1.1821 1.0534 1.1922 2.0286 1.8122 5.7647 6.3112 1.6058 2.5371 5.9980 1.0544 1.0362 1.0618 1.0638 1.1052 1.0978 1.0989 1.1004 1.1008 1.0889 1.0910 1.0937 1.1613 1.0804 1.0448 1.1042
irintensity: 0.1745 0.0603 7.0980 2.8692 0.0896 1.6602 1.8920 0.2611 7.8328 0.2267 1.1420 0.9898 9.1262 0.6321 2.4536 50.7410 174.4638 2.3370 2.4526 110.0137 6.3543 3.1445 2.6689 5.5469 1.7799 16.4645 1.3693 68.8248 0.6390 57.0780 0.7240 102.5594 0.1758 6.7139 52.8248 7.8331 58.1917 12.0850 5.8087 5.5536 11.3574 20.9356 43.4377 8.9819 96.9328 1.3842 12.1000 21.1099 8.5214 13.1622 5.6226 20.7351 170.6934 0.4136 24.8550 69.2259 13.0479 50.0722 55.8116 2.3599 12.4533 2.2961 4.1832 46.3358 21.6069 22.3830 6.8883 58.1979 14.5908 66.3881 154.7035 243.8571 173.6212 123.1879 51.4726 161.3889 2.3303 36.8881 33.0250 33.3775 51.3677 19.5254 9.5972 43.5862 35.2222 64.9033 21.2386 12.8385 20.2984 68.8695 149.4096 79.5676 21.6130
temp: 298.150 k
press: 1.00000 atm
elementType: 8 8 7 7 6 6 6 6 6 6 6 6 6 6 6 6 6 1 1 1 1 1 1 1 1 1 1 1 1 1 1 1 1
symmnumber: 1
zpe: 696662.1 jmol-1
zpe.correction: 0.265345 hartree
zpe.thermalcorrener: 0.283407 hartree
zpe.thermalcorrenthalpy: 0.284351 hartree
zpe.thermalcorrgfe: 0.217578 hartree
zpe.sumelectzpe: -763.615615 hartree
zpe.sumelectthermal: -763.597552 hartree
zpe.sumelectthermalent: -763.596608 hartree
zpe.sumelectthermalfe: -763.663381 hartree
dipole: -1.3484 4.5105 0.6122
dipole: 4.7474
quadrupole: -68.6347 -99.0092 -105.3158
quadrupole: 1.8838 -4.2671 -0.8117
quadrupole: 22.3519 -8.0227 -14.3292 1.8838 -4.2671 -0.8117
hfenergy: -763.8809593 hartree
pointgroup: C01 [X(C13H16N2O2)]
dipole: -0.4352978 1.8056883 0.1964737 debye
polarizability: 242.4299837|12.2083864|171.1649702|-11.6072495|2.9295861|87.4460944 unknown
InChI: InChI=1S/C13H16N2O2/c1-3-7-15-13(16)11-9-10(14)5-6-12(11)17-8-4-2/h2,5-6,9,15H,3,7-8,14H2,1H3
charge 0 multiplicity 1
33 atoms
O  0.539458 1.382199 -0.290343
O  -0.304995 -2.798075 -0.430015
N  1.32404 -1.150562 -0.62887
N  -4.748925 -0.603482 0.245997
C  2.417108 -2.114279 -0.822493
C  3.158637 -2.468757 0.491401
C  -1.027714 -0.486233 -0.222905
C  0.023807 -1.563623 -0.430073
C  -0.80331 0.922819 -0.153344
C  -2.350629 -0.95981 -0.084964
C  -3.455266 -0.091595 0.115731
C  3.852689 -1.256367 1.148481
C  -1.890822 1.80246 0.04609
C  -3.203326 1.306058 0.178743
C  0.774282 2.835286 -0.19326
C  2.211408 3.084752 -0.334216
C  3.413018 3.328332 -0.447647
H  3.132316 -1.686119 -1.551825
H  1.977493 -3.029463 -1.255646
H  2.430798 -2.918433 1.192643
H  3.908649 -3.251771 0.260435
H  1.515415 -0.142494 -0.596205
H  -2.479535 -2.047488 -0.139909
H  3.117886 -0.473352 1.412492
H  4.377363 -1.550649 2.0757
H  4.599406 -0.805628 0.466166
H  -1.739929 2.884447 0.100414
H  -4.031417 2.008421 0.33198
H  -5.543479 0.011248 0.391171
H  -4.914188 -1.60419 0.200046
H  0.212388 3.357624 -0.995042
H  0.414628 3.20492 0.789305
H  4.46295 3.537804 -0.54624
