program: Gaussian 09
title: 000207698
version: EM64L-G09RevD.01
frameworkgroup: C1[X(C12H13ClN2O2)]
method: RPBEPBE
basis: SDD
operation: Freq
keyword: #p
keyword: freq=noraman
keyword: PBEPBE/SDD
title: #p freq=noraman PBEPBE/SDD
converged: YES YES NO NO
title: Mulliken charges:
elementType: Cl O O N N C C C C C C C C C C C C H H H H H H H H H H H H H
charge: -0.068958 -0.335512 -0.305954 -0.394179 -0.697269 0.129306 0.298929 -0.560048 0.162459 0.666256 -0.316868 -0.348969 -0.400459 -0.653985 -0.345189 0.177906 -0.446179 0.283728 0.262003 0.249319 0.206931 0.369597 0.206576 0.245015 0.210851 0.318064 0.318603 0.242658 0.242760 0.282607
chargesum: 0.00000
title: Mulliken charges with hydrogens summed into heavy atoms:
elementType: Cl O O N N C C C C C C C C C C C C
charge: -0.068958 -0.335512 -0.305954 -0.024582 -0.060603 0.129306 0.298929 -0.276319 0.162459 0.666256 -0.054865 0.107281 -0.400459 0.008457 0.140230 0.177906 -0.163572
polarizability: 2.47550878e+02 1.78573626e+01 1.80752482e+02 -3.85549015e+00 2.04234797e+00 7.82166952e+01
1716.lowfreq: -6.9470 -0.0010 -0.0007 0.0002 0.6324 3.8733 14.6487 33.1915 45.1319
frequency: 14.2574 33.1430 45.1291 69.4742 71.5319 92.3205 105.5858 138.2085 169.5480 180.4042 218.7395 227.1070 250.9570 263.0392 301.8408 322.3842 328.4416 350.5546 369.9054 394.9190 418.3186 423.0695 439.2432 459.6406 503.3859 555.1643 599.0332 603.5631 641.3249 680.9288 691.0466 701.5020 718.9774 741.2055 752.3311 794.7380 823.0252 830.3633 888.4888 931.1194 938.9484 959.9185 994.1038 998.1114 1043.6311 1051.9404 1084.1923 1127.4849 1152.5797 1182.8723 1203.8486 1253.1775 1258.8769 1296.4049 1308.9071 1351.1285 1355.4630 1381.7489 1388.5445 1418.5848 1455.8047 1467.4118 1467.9290 1482.7160 1491.2966 1530.3230 1569.3518 1586.0381 1621.9757 1649.5388 2159.5935 2953.8228 2983.1717 3005.7220 3008.1717 3067.8987 3083.3721 3100.6764 3134.3631 3179.2293 3425.6522 3450.2942 3562.3818 3708.0970
redmass: 2.6460 5.2950 5.7280 6.6919 4.9991 3.1954 3.8483 3.3604 6.5620 4.0642 1.4476 5.2662 5.1857 5.6414 3.1794 5.2444 3.1809 5.2014 2.6679 1.6005 1.6795 4.5960 2.1180 2.7076 5.0941 8.1912 4.5450 7.4534 1.2295 5.6371 1.2655 4.2792 1.1688 1.8908 4.6907 3.7606 1.5971 2.5083 2.2992 1.4988 5.8725 4.1050 4.1203 1.5828 1.6971 2.4667 2.1895 3.5802 1.8400 2.4107 1.0518 2.6332 1.3400 1.1468 3.4665 1.4127 1.2917 1.2117 5.2158 6.4573 1.1129 1.1670 1.0519 1.0576 3.0052 1.8198 8.0059 5.4994 1.4156 3.6607 5.9953 1.0545 1.0353 1.0624 1.1054 1.1004 1.0988 1.1024 1.0908 1.0912 1.1615 1.0804 1.0451 1.1041
irintensity: 0.0675 0.0399 3.1848 3.8450 0.2909 4.4948 1.5360 4.4167 0.0768 4.3404 4.3463 0.5994 0.9812 3.7332 7.1436 3.1391 20.1079 4.4284 53.3634 97.7053 107.1256 28.4779 33.0298 5.9279 6.1286 0.0886 0.4477 5.6683 68.6632 5.4648 51.0882 6.7767 101.2441 17.1528 4.9077 91.0455 21.5111 3.1084 1.1040 29.3147 69.6723 23.8115 111.4571 1.6472 42.3101 15.8757 12.9897 37.2071 6.6737 177.9292 0.4764 113.3461 5.2385 24.3079 6.0523 12.4921 19.6742 18.7373 36.3174 27.7468 25.8509 75.1273 6.2422 9.9110 286.3607 209.2471 78.8194 220.3402 146.7233 99.6877 3.5126 31.0053 35.0826 47.6404 18.8517 5.6592 50.1756 31.5562 12.1916 4.7905 71.7552 144.9347 95.3497 34.1482
temp: 298.150 k
press: 1.00000 atm
elementType: 17 8 8 7 7 6 6 6 6 6 6 6 6 6 6 6 6 1 1 1 1 1 1 1 1 1 1 1 1 1
symmnumber: 1
zpe: 598367.6 jmol-1
zpe.correction: 0.227906 hartree
zpe.thermalcorrener: 0.245916 hartree
zpe.thermalcorrenthalpy: 0.246860 hartree
zpe.thermalcorrgfe: 0.179787 hartree
zpe.sumelectzpe: -1183.784251 hartree
zpe.sumelectthermal: -1183.766241 hartree
zpe.sumelectthermalent: -1183.765297 hartree
zpe.sumelectthermalfe: -1183.832370 hartree
dipole: -0.1476 3.3634 0.1965
dipole: 3.3724
quadrupole: -89.2341 -101.3473 -110.8019
quadrupole: 16.5139 -0.4580 -0.8449
quadrupole: 11.2270 -0.8862 -10.3408 16.5139 -0.4580 -0.8449
hfenergy: -1184.0121572 hartree
pointgroup: C01 [X(C12H13Cl1N2O2)]
dipole: -0.1416553 -1.1415608 0.6612015 debye
polarizability: 248.0876279|-5.3215797|156.1231865|-24.4265481|-39.4178827|102.3092407 unknown
InChI: InChI=1S/C12H13ClN2O2/c1-3-5-17-11-7-9(13)10(14)6-8(11)12(16)15-4-2/h1,6-7,15H,4-5,14H2,2H3
charge 0 multiplicity 1
30 atoms
Cl 4.395068 -1.576037 0.186177
O  -0.818077 -0.881451 0.49064
O  -0.479487 2.856028 -1.55098
N  -1.927518 1.310228 -0.591957
N  4.201122 1.131304 -1.248359
C  0.505446 0.844058 -0.6142
C  0.454686 -0.409843 0.069369
C  1.762648 1.325098 -1.035757
C  -0.67047 1.745376 -0.949649
C  2.980352 0.627043 -0.817695
C  1.643742 -1.135141 0.30619
C  -3.126307 2.119187 -0.861796
C  2.869963 -0.612634 -0.135483
C  -3.510153 3.034116 0.323137
C  -0.862192 -2.170709 1.211775
C  -2.25386 -2.458982 1.565056
C  -3.412071 -2.734148 1.87892
H  1.756527 2.291149 -1.55461
H  1.644822 -2.096578 0.824058
H  -2.914428 2.736546 -1.751501
H  -3.959658 1.433162 -1.103757
H  -2.003189 0.418912 -0.08806
H  -3.713741 2.445108 1.235959
H  -2.690189 3.74061 0.53809
H  -4.416668 3.618528 0.078687
H  5.05867 0.612214 -1.080142
H  4.245714 2.020913 -1.734978
H  -0.455615 -2.972046 0.561033
H  -0.238173 -2.10329 2.126673
H  -4.424265 -2.97272 2.15216
