program: Gaussian 09
title: 000000951
version: EM64L-G09RevD.01
frameworkgroup: C1[X(C8H11NO3)]
method: RPBEPBE
basis: SDD
operation: Freq
keyword: #p
keyword: freq=noraman
keyword: PBEPBE/SDD
title: #p freq=noraman PBEPBE/SDD
converged: YES YES NO NO
title: Mulliken charges:
elementType: O O O N C C C C C C C C H H H H H H H H H H H
charge: -0.476614 -0.438385 -0.489040 -0.633904 -0.174031 0.510968 -0.457140 -0.502634 -0.447066 0.196492 -0.333641 0.125979 0.198609 0.245478 0.217700 0.300652 0.229081 0.216874 0.367434 0.303562 0.288895 0.380746 0.369984
chargesum: 0.00000
title: Mulliken charges with hydrogens summed into heavy atoms:
elementType: O O O N C C C C C C C C
charge: -0.109180 -0.057639 -0.119056 -0.041446 0.024578 0.510968 0.006038 -0.201982 -0.217985 0.196492 -0.116767 0.125979
polarizability: 1.47210432e+02 2.18124997e-01 1.06933980e+02 4.87741077e+00 4.23861625e+00 6.00381980e+01
1716.lowfreq: -6.6077 -0.0007 -0.0001 0.0002 9.7557 9.9632 33.7736 75.4447 102.7974
frequency: 33.6085 75.4352 102.7359 172.3626 190.0707 234.6549 254.2341 276.4287 281.6433 320.2302 327.8389 386.5344 442.0559 455.4381 484.2460 535.2954 562.5880 577.0810 622.7957 687.1831 716.0300 742.8553 768.0236 771.6440 782.0634 867.8029 890.8678 914.3793 931.7767 955.0118 1039.6985 1060.1365 1072.9566 1126.2478 1141.3830 1143.3917 1176.9501 1233.9320 1260.0799 1269.5563 1271.9552 1294.5354 1320.9437 1348.1484 1401.5332 1414.9013 1460.6183 1470.2951 1501.0086 1609.5510 1631.0842 1638.4760 2902.2363 2961.1423 3061.9609 3112.8192 3138.4476 3181.4053 3236.3810 3468.8271 3525.4961 3594.4755 3623.8015
redmass: 4.5644 4.4255 2.6117 5.3555 4.6812 2.1469 1.5596 1.2617 4.9669 3.2437 6.2393 5.5390 3.2243 3.4390 1.1104 4.4223 3.5379 5.6289 4.3906 1.2339 4.0407 4.7896 2.1875 1.4370 1.5411 2.8342 1.4043 1.3891 1.5593 3.0254 3.9095 2.8733 2.5084 1.4224 1.4541 1.4059 1.4871 1.8456 1.4863 1.2210 2.2807 1.3017 1.2724 1.2633 1.8563 3.5941 1.0940 3.1274 3.4058 7.2206 6.7511 1.0936 1.0832 1.0659 1.0978 1.0873 1.0963 1.0919 1.0632 1.0462 1.0648 1.0976 1.0665
irintensity: 4.0026 4.4780 2.9475 0.9389 0.8105 83.1193 95.9706 7.6841 8.1140 6.7469 9.7561 6.7992 14.9085 10.0418 128.8573 2.4769 39.4157 2.6249 6.4539 137.2344 0.9463 29.1700 84.0219 122.1760 46.3939 11.9657 13.0464 14.8878 4.2284 55.5606 38.5721 154.1534 45.4253 64.4158 30.9373 31.6129 37.1159 41.6390 79.0012 30.3855 82.6123 24.2029 95.9723 4.8090 92.0620 5.8978 9.4092 4.7096 112.4628 35.6621 2.2663 39.1385 63.1450 52.1618 22.6155 16.6210 16.5516 2.5092 149.4899 0.6463 75.6258 7.0403 50.8628
temp: 298.150 k
press: 1.00000 atm
elementType: 8 8 8 7 6 6 6 6 6 6 6 6 1 1 1 1 1 1 1 1 1 1 1
symmnumber: 1
zpe: 478848.9 jmol-1
zpe.correction: 0.182384 hartree
zpe.thermalcorrener: 0.194370 hartree
zpe.thermalcorrenthalpy: 0.195314 hartree
zpe.thermalcorrgfe: 0.144264 hartree
zpe.sumelectzpe: -590.942061 hartree
zpe.sumelectthermal: -590.930075 hartree
zpe.sumelectthermalent: -590.929131 hartree
zpe.sumelectthermalfe: -590.980180 hartree
dipole: -1.1485 -4.7378 2.3389
dipole: 5.4070
quadrupole: -44.1724 -69.7415 -74.6889
quadrupole: -3.1675 -6.3246 3.3184
quadrupole: 18.6952 -6.8739 -11.8213 -3.1675 -6.3246 3.3184
hfenergy: -591.1244445 hartree
pointgroup: C01 [X(C8H11N1O3)]
dipole: 0.445697 -1.1979988 -1.7004527 debye
dipolederiv: -0.6739413 -0.0706964 -0.0578491 -0.1654227 -0.5468014 -0.0191983 -0.1886217 -0.0958326 -0.7035474 -0.6712092 0.5535396 0.2181178 0.6562918 -0.8844168 -0.1293926 0.2357366 -0.1227805 -0.4411428 -1.4985993 -0.0289548 -0.1344154 0.000921 -0.1599254 0.103616 -0.1661092 0.1004112 -0.4166277 -0.811141 -0.1588399 0.0196041 -0.1965653 -0.2781289 -0.1356212 0.0694162 -0.1562058 -0.6410297 0.357014 0.0349866 0.1034168 0.0642463 0.4858149 0.0269437 0.3666518 0.0853783 0.3699994 0.2422529 -0.0397717 -0.0479129 0.1049436 0.0238879 0.0434671 0.0403057 0.0392902 -0.0792522 0.5581005 0.1311963 0.0612064 0.092889 0.18975 0.0769949 -0.235957 0.0435343 0.1250203 -0.2115117 0.1782086 0.1034046 -0.0220291 -0.0857483 0.0260322 0.0463798 0.0818956 -0.1027212 -0.1615345 0.0378729 0.0461657 -0.0877792 -0.0515978 0.0465499 -0.0309094 0.0571682 -0.1764318 0.4150162 -0.5076026 -0.1763239 -0.8130774 0.7644269 0.2064925 -0.2963962 0.2297218 0.1360148 -0.0797665 -0.0617315 -0.0071857 0.0784401 0.0218891 0.0830846 0.0437653 0.0656862 -0.1268431 1.2108699 -0.0094042 0.1558198 0.269415 -0.1675953 -0.0307002 0.2870217 -0.0699495 0.0068218 -0.0554859 0.0542267 -0.0354401 0.0702204 -0.2266013 0.0153499 -0.0153733 0.0086602 -0.0092414 0.0242682 0.0510425 -0.0370353 0.0535956 -0.0618345 0.0882339 -0.0560985 0.0286379 0.0562071 -0.0126359 -0.0485758 -0.0289783 -0.0654983 -0.0631472 -0.1622646 -0.032962 -0.1110843 -0.0778603 0.1561105 -0.0289482 -0.023599 -0.0314263 0.0498765 -0.0432126 -0.0111543 -0.0511024 0.1399382 0.0162797 0.1113866 0.0140108 0.1007143 -0.023123 -0.0593834 0.0140321 -0.0534277 0.1322903 -0.0080441 -0.0937897 -0.0613142 -0.085635 -0.0188991 -0.0887881 -0.0649343 -0.0920573 0.1243618 0.3214458 -0.022818 -0.0794053 0.0185128 0.2765438 -0.0235752 -0.0693879 0.0051574 0.4528724 0.0856963 -0.0240794 0.0316342 0.0042985 0.1993099 0.0891415 0.095178 0.1428011 0.1912602 0.1104606 0.0316579 -0.0026722 0.0910392 0.080058 0.0289427 0.0313586 0.0035181 0.313349 0.2745542 -0.1194797 -0.0701347 -0.1140892 0.3525597 -0.0284171 -0.062373 -0.0338655 0.3655009 0.4118007 0.0305741 0.0088858 -0.0240051 0.1237022 -0.1142956 0.0004311 -0.1055548 0.3610616 unknown
polarizability: 147.3502371|-1.7157772|99.8507571|2.9921208|17.3404361|66.9816157 unknown
InChI: InChI=1S/C8H11NO3/c9-4-8(12)5-1-2-6(10)7(11)3-5/h1-3,8,10-12H,4,9H2
charge 0 multiplicity 1
23 atoms
O  2.407627 0.621589 1.443658
O  -2.41683 1.917713 0.757622
O  -3.690664 -0.189393 -0.342695
N  4.135378 0.451997 -0.585891
C  2.010952 -0.324996 0.410157
C  0.500584 -0.337715 0.239189
C  2.732261 0.100268 -0.914053
C  -0.26503 0.795596 0.604254
C  -0.139197 -1.464919 -0.331792
C  -1.65427 0.802489 0.39139
C  -1.53764 -1.462043 -0.551246
C  -2.287555 -0.328659 -0.190488
H  2.35485 -1.350676 0.681368
H  2.234979 1.007762 -1.300589
H  2.62781 -0.698061 -1.678185
H  0.22323 1.649688 1.080019
H  0.444896 -2.354603 -0.594823
H  -2.032198 -2.338014 -0.990292
H  3.334642 0.896813 1.150103
H  4.539167 1.199878 -1.155486
H  4.769305 -0.349387 -0.501464
H  -3.370494 1.732412 0.549522
H  -4.101703 -1.005141 -0.715179
