program: Gaussian 09
title: 000207678
version: EM64L-G09RevD.01
frameworkgroup: C1[X(C14H20N2O2)]
method: RPBEPBE
basis: SDD
operation: Freq
keyword: #p
keyword: freq=noraman
keyword: PBEPBE/SDD
title: #p freq=noraman PBEPBE/SDD
converged: YES YES NO NO
title: Mulliken charges:
elementType: O O N N C C C C C C C C C C C C C C H H H H H H H H H H H H H H H H H H H H
charge: -0.348970 -0.308579 -0.394213 -0.709799 -0.334010 -0.405794 -0.349188 0.111121 0.151297 -0.689630 0.281912 -0.555381 0.549680 -0.321386 -0.449192 -0.330791 -0.067130 -0.549365 0.220592 0.189071 0.252413 0.203320 0.186721 0.201209 0.371648 0.214921 0.210755 0.208740 0.276834 0.237606 0.217969 0.215553 0.217197 0.302301 0.312189 0.232960 0.225486 0.221934
chargesum: 0.00000
title: Mulliken charges with hydrogens summed into heavy atoms:
elementType: O O N N C C C C C C C C C C C C C C
charge: -0.348970 -0.308579 -0.022564 -0.095309 0.075652 0.049938 0.038742 0.111121 0.151297 -0.055213 0.281912 -0.278547 0.549680 -0.083781 -0.231223 0.101959 0.165830 -0.101944
polarizability: 2.41153529e+02 1.86818909e+01 1.95651805e+02 -1.89958032e+01 -1.83701610e+00 1.09535358e+02
1716.lowfreq: -3.7462 -0.0002 0.0007 0.0008 5.4429 8.6559 14.8029 32.3052 39.1459
frequency: 13.4008 32.2885 39.0144 53.9267 61.4053 69.3149 99.0121 113.4367 117.7836 144.4542 163.2107 184.5061 226.3066 231.8840 253.2048 288.4599 303.4749 308.1657 324.9799 357.9632 360.7904 382.1183 396.6006 434.3883 445.3501 488.7537 509.5084 565.1167 588.4576 631.0524 662.0051 688.7572 725.1481 733.9435 754.3361 757.8327 773.8046 797.2231 833.1136 846.8120 905.5935 907.4095 922.2316 933.0612 960.9441 962.8672 971.4658 976.8914 986.9996 1010.1963 1030.4302 1045.9106 1064.5202 1108.1160 1120.9735 1139.6967 1148.9741 1169.0257 1186.8723 1223.8273 1227.6219 1252.6854 1262.2129 1266.7594 1283.3171 1288.9190 1312.0533 1328.5487 1346.4532 1350.3276 1365.4307 1388.1856 1390.5232 1432.9321 1436.1062 1452.0979 1457.0300 1472.6551 1472.7774 1476.5981 1485.0973 1491.2350 1529.3635 1580.7996 1590.6821 1635.0066 1647.9484 1665.7728 2948.9192 2957.7602 2971.7011 2973.9562 2985.3047 3004.7446 3018.4416 3042.3136 3069.2611 3070.1757 3073.4863 3093.6275 3116.0828 3125.5881 3133.7566 3162.8576 3204.6246 3432.8220 3572.2257 3713.3015
redmass: 3.8522 4.9291 4.2581 5.4495 2.3423 1.9064 2.8762 2.7365 3.0954 3.6709 3.6992 4.1926 1.3277 2.7579 2.8623 3.2080 3.2700 3.5378 1.1813 1.5235 2.4118 4.1983 3.2711 2.9432 2.8092 3.8732 2.6689 3.4952 4.4865 1.7500 5.6876 4.0385 1.0973 1.5101 2.3167 4.0638 4.1841 1.5469 1.9045 2.1826 2.1598 1.4610 1.5812 1.4347 1.8948 1.3924 1.9243 2.9850 1.5981 1.2798 1.8647 2.1386 2.5972 2.8615 2.1181 2.0299 1.6848 1.4579 2.5752 1.2213 1.3402 2.2110 1.6390 1.3584 1.2400 1.1131 1.2133 2.5260 1.4327 1.3545 1.3679 1.2166 6.0085 1.2017 3.5949 1.1390 1.0941 1.0695 1.2310 1.0429 1.0762 2.4285 1.8576 5.7944 6.0570 1.5099 2.8188 4.7517 1.0572 1.0592 1.0418 1.0560 1.0657 1.0977 1.1044 1.1008 1.0997 1.1000 1.0992 1.0604 1.0950 1.0890 1.0909 1.0936 1.1146 1.0806 1.0448 1.1042
irintensity: 0.1567 0.4516 2.4768 6.6091 0.0861 0.0524 0.6676 0.1781 2.4488 0.5613 3.7087 1.2585 1.5187 4.3248 5.6501 2.8979 2.0510 5.3958 238.7315 28.6072 55.4749 1.6987 13.2840 1.5251 0.8701 2.5854 1.4836 16.5704 4.7815 10.2004 0.7945 0.8868 83.4675 14.6886 25.3912 12.7313 28.5129 53.6886 5.6403 2.6401 9.8022 7.1907 3.8560 18.7164 1.1388 129.3115 3.1915 101.9265 7.1134 14.7282 2.4558 14.2781 20.3983 10.7047 9.9780 5.6161 2.0265 18.8099 159.8615 2.1672 7.9991 72.1301 31.8206 35.5438 1.0434 1.2485 21.1540 54.1210 1.6679 3.2586 4.4981 10.4331 22.0827 37.6036 22.4113 25.7532 6.3388 14.6999 60.4249 8.6112 12.9142 213.2170 264.5206 142.6345 152.9530 63.6638 145.3545 2.9875 43.8410 31.3053 20.7467 75.0566 48.6762 8.5630 28.0870 48.3449 60.1942 59.6558 22.7571 10.9637 9.6826 21.1013 13.0788 19.2572 21.0847 165.9960 77.0261 21.0114
temp: 298.150 k
press: 1.00000 atm
elementType: 8 8 7 7 6 6 6 6 6 6 6 6 6 6 6 6 6 6 1 1 1 1 1 1 1 1 1 1 1 1 1 1 1 1 1 1 1 1
symmnumber: 1
zpe: 831987.2 jmol-1
zpe.correction: 0.316887 hartree
zpe.thermalcorrener: 0.336618 hartree
zpe.thermalcorrenthalpy: 0.337562 hartree
zpe.thermalcorrgfe: 0.266398 hartree
zpe.sumelectzpe: -804.064353 hartree
zpe.sumelectthermal: -804.044622 hartree
zpe.sumelectthermalent: -804.043678 hartree
zpe.sumelectthermalfe: -804.114842 hartree
dipole: -1.0465 4.6995 0.9641
dipole: 4.9102
quadrupole: -80.0582 -106.0445 -112.0304
quadrupole: 1.9243 -6.0569 -2.4395
quadrupole: 19.3195 -6.6668 -12.6527 1.9243 -6.0569 -2.4395
hfenergy: -804.3812405 hartree
pointgroup: C01[X(C14H20N2O2)]
dipole: 0.3733074 1.8620595 -0.3538975 debye
polarizability: 241.8585187|-17.4638483|194.8478292|-19.4186541|2.6509586|109.6343438 unknown
InChI: InChI=1S/C14H20N2O2/c1-3-5-8-16-14(17)12-10-11(15)6-7-13(12)18-9-4-2/h4,6-7,10,16H,2-3,5,8-9,15H2,1H3
charge 0 multiplicity 1
38 atoms
O  -0.115315 1.413078 0.291848
O  0.403344 -2.810949 0.65106
N  -1.055055 -1.013732 0.895644
N  4.947565 -1.033718 -0.475726
C  -3.172676 -2.098809 0.06218
C  -2.206883 -1.855151 1.2484
C  -3.814561 -0.80807 -0.496137
C  1.292009 -0.583083 0.246828
C  0.181081 -1.553732 0.606996
C  -4.81841 -1.087663 -1.635623
C  1.168485 0.832315 0.092317
C  2.560788 -1.171567 0.050065
C  3.7095 -0.411312 -0.289496
C  2.304082 1.604338 -0.242066
C  3.561003 0.995508 -0.431098
C  -0.283014 2.854308 0.013176
C  -1.752538 3.166604 0.115052
C  -2.263921 4.143044 0.903518
H  -2.621909 -2.62233 -0.743284
H  -3.972829 -2.787544 0.404294
H  -1.807489 -2.81977 1.606445
H  -2.754143 -1.370348 2.081203
H  -4.32779 -0.26904 0.327867
H  -3.014376 -0.13519 -0.866522
H  -1.15285 0.00618 0.821365
H  -4.323471 -1.604574 -2.479131
H  -5.263758 -0.153445 -2.025319
H  -5.644007 -1.735379 -1.2850
H  2.610074 -2.260323 0.171586
H  2.229933 2.689947 -0.353052
H  4.427206 1.616941 -0.688588
H  0.3058 3.450974 0.737938
H  0.091303 3.060397 -1.012245
H  5.77316 -0.495253 -0.717879
H  5.03952 -2.03951 -0.372526
H  -2.412586 2.562426 -0.522949
H  -3.336577 4.363809 0.918258
H  -1.624996 4.751723 1.5554
