program: Gaussian 09
title: 000207674
version: EM64L-G09RevD.01
frameworkgroup: C1[X(C19H21ClN2)]
method: RPBEPBE
basis: SDD
operation: Freq
keyword: #p
keyword: freq=noraman
keyword: PBEPBE/SDD
title: #p freq=noraman PBEPBE/SDD
converged: YES YES NO NO
title: Mulliken charges:
elementType: Cl N N C C C C C C C C C C C C C C C C C C C H H H H H H H H H H H H H H H H H H H H H
charge: -0.072207 -0.240246 -0.077983 0.400049 -0.601455 0.269093 0.144062 -0.354492 0.167857 0.368966 -0.524363 -0.336143 -0.298572 -0.695588 -0.320740 -0.403423 -0.163056 -0.277072 -0.250112 -0.271696 -0.618158 -0.621080 0.211835 0.236545 0.207779 0.227666 0.226007 0.258988 0.242311 0.201244 0.250380 0.253205 0.237210 0.235798 0.254890 0.226207 0.230097 0.226742 0.188253 0.221716 0.221841 0.191501 0.226143
chargesum: 0.00000
title: Mulliken charges with hydrogens summed into heavy atoms:
elementType: Cl N N C C C C C C C C C C C C C C C C C C C
charge: -0.072207 -0.240246 -0.077983 0.400049 -0.153075 0.269093 0.144062 0.080953 0.167857 0.368966 -0.298356 -0.077155 -0.056262 0.009242 -0.083531 -0.167624 -0.163056 -0.022182 -0.023905 -0.041599 0.018552 0.018405
polarizability: 3.33883473e+02 3.74029146e+01 2.35368981e+02 -7.96537604e+00 2.86562916e+01 1.64898190e+02
1716.lowfreq: -8.6966 -2.7527 -0.0015 -0.0014 0.0003 4.0711 21.9485 25.6950 33.6970
frequency: 21.3820 25.5834 33.6577 48.4210 75.8655 101.0583 104.9293 142.8055 154.0019 162.4366 202.2860 203.8154 209.0372 237.6039 265.7861 284.4588 311.6831 313.8271 325.8500 351.4923 358.6320 362.6411 378.4560 400.0948 412.7400 441.3699 455.2979 481.2124 486.6118 539.7816 547.8380 561.7735 580.3451 624.2585 637.4338 663.5531 691.2595 733.2356 736.6900 757.6445 780.1833 803.1174 808.0009 820.8013 828.2667 853.0656 875.5774 882.3546 891.1472 933.2816 940.8046 975.9168 1015.4313 1017.4629 1031.9165 1041.0776 1051.5378 1056.6897 1062.7704 1089.7536 1098.0509 1109.7099 1120.6714 1128.9686 1133.3430 1146.7613 1158.7703 1174.9670 1211.7470 1230.2881 1240.2963 1243.3268 1255.5482 1262.3990 1272.2387 1286.0157 1304.0832 1309.7255 1357.3651 1363.7443 1367.0870 1382.6344 1401.7111 1417.6133 1434.8704 1440.9051 1442.8021 1461.4111 1462.7326 1467.9646 1468.4942 1475.8052 1476.7644 1482.4454 1488.7884 1493.4210 1502.4912 1563.5847 1582.3713 1588.3737 1600.2199 1642.3030 2847.5459 2851.5542 2867.6703 2916.3808 2985.5840 3018.3101 3023.5812 3028.3054 3039.0962 3058.8043 3076.7687 3082.7446 3090.6986 3097.2736 3120.2829 3132.2262 3152.3962 3152.9550 3166.1711 3173.4871 3176.6645
redmass: 2.8860 4.1481 4.6456 4.7352 4.1079 2.2315 4.5473 3.6371 4.3995 4.7032 2.8853 1.7284 2.0360 1.2603 3.3400 5.7894 2.1765 1.9674 1.7057 3.3497 4.0388 3.3879 3.9770 3.7540 2.9736 3.7235 3.0882 4.4793 3.6729 3.8053 3.8851 3.6727 4.3575 5.4928 5.7577 5.5503 5.4902 3.1510 3.1504 1.4152 1.5320 3.1388 1.4730 3.4033 4.1353 1.4045 1.7684 2.2961 1.9096 1.3458 1.4265 1.3274 2.8883 2.4920 1.6653 4.0116 2.2610 2.5217 2.6506 1.3012 2.1801 1.4158 1.6554 1.5345 1.4980 1.4501 1.6431 1.0645 2.3828 2.0780 1.8427 2.9717 1.7305 2.0898 1.7051 1.3640 1.4164 2.3389 2.4272 5.6991 1.3923 6.5128 2.1739 1.1420 1.9228 1.3168 1.1605 1.0524 1.1062 2.2591 1.0601 1.1045 1.0594 1.0924 1.2339 1.9705 1.0742 7.0134 7.4656 6.9265 6.0943 7.9672 1.0569 1.0651 1.0614 1.0520 1.0639 1.0725 1.0852 1.0734 1.0790 1.0983 1.1009 1.1002 1.0882 1.1019 1.0872 1.0882 1.0920 1.0884 1.1001 1.0951 1.0924
irintensity: 0.7466 0.2315 0.0436 0.1256 0.5600 1.0646 0.3678 3.4505 0.5881 0.1767 1.2243 0.5288 1.3511 0.5962 0.3018 2.1744 0.2881 2.5531 2.7806 5.2313 2.5158 0.4294 2.8744 2.4989 0.7319 11.2585 0.7878 16.8920 2.5717 5.5248 3.0546 5.0913 10.9511 0.7859 4.9800 10.4306 0.4362 10.3334 1.8531 77.8663 12.5051 24.5893 45.9498 19.0799 20.3161 2.8828 8.9913 19.0614 4.2596 0.4040 6.5491 0.0941 16.8890 8.2420 23.2092 5.2639 24.5940 30.4032 17.5449 7.6221 14.7079 5.2945 56.9237 5.8475 15.6577 9.6696 9.0322 0.4239 10.2086 18.6208 4.2034 35.1042 0.9264 9.5288 14.5102 3.2904 3.8539 62.5488 4.4499 17.7300 5.2147 2.7634 11.6557 3.4783 31.8356 20.0806 2.7780 22.3955 13.7331 187.1129 17.7472 20.0485 24.5960 0.4934 19.9230 36.0407 5.7314 4.5187 1.8572 7.5393 14.1135 3.6631 65.6115 67.7048 186.3670 89.5026 19.9440 45.8244 29.2350 36.3414 26.5688 23.8376 27.8638 61.4777 20.5619 17.2949 7.8991 7.4379 18.7571 11.6792 32.2804 7.9471 0.9307
temp: 298.150 k
press: 1.00000 atm
elementType: 17 7 7 6 6 6 6 6 6 6 6 6 6 6 6 6 6 6 6 6 6 6 1 1 1 1 1 1 1 1 1 1 1 1 1 1 1 1 1 1 1 1 1
symmnumber: 1
zpe: 922902.9 jmol-1
zpe.correction: 0.351515 hartree
zpe.thermalcorrener: 0.372266 hartree
zpe.thermalcorrenthalpy: 0.373210 hartree
zpe.thermalcorrgfe: 0.300695 hartree
zpe.sumelectzpe: -1304.557124 hartree
zpe.sumelectthermal: -1304.536374 hartree
zpe.sumelectthermalent: -1304.535430 hartree
zpe.sumelectthermalfe: -1304.607945 hartree
dipole: -1.5601 -0.4892 2.0773
dipole: 2.6435
quadrupole: -128.2423 -139.6596 -133.9549
quadrupole: -7.6393 -1.6724 8.5798
quadrupole: 5.7099 -5.7073 -0.0026 -7.6393 -1.6724 8.5798
hfenergy: -1304.9086395 hartree
pointgroup: C01 [X(C19H21Cl1N2)]
dipole: 0.5607698 -0.1100365 -0.8689853 debye
polarizability: 329.38165|-40.0349052|243.6756438|-23.0774945|-16.48444|161.0933504 unknown
InChI: InChI=1S/C19H21ClN2/c1-21(2)11-10-14-12-15-6-4-5-7-18(15)22(3)19-9-8-16(20)13-17(14)19/h4-9,12-13H,10-11H2,1-3H3
charge 0 multiplicity 1
43 atoms
Cl -3.040996 3.585789 1.662596
N  1.530599 0.71566 -1.149461
N  -3.907706 -2.342424 -0.407214
C  -0.436351 -0.86454 0.492887
C  -1.756149 -1.607966 0.688481
C  -0.483627 0.617462 0.34426
C  0.466718 1.364339 -0.429851
C  -2.670974 -1.538765 -0.562934
C  2.515074 -0.041889 -0.425171
C  2.121607 -1.153768 0.385519
C  0.726634 -1.594373 0.526842
C  -1.539064 1.336095 0.973655
C  0.316393 2.771968 -0.549987
C  1.959942 1.336212 -2.416534
C  3.895059 0.253653 -0.577479
C  3.137306 -1.926596 1.013074
C  -1.654613 2.727467 0.836295
C  -0.743246 3.468863 0.067874
C  4.884275 -0.528977 0.057783
C  4.506217 -1.62435 0.865098
C  -4.554221 -2.61314 -1.708656
C  -4.861215 -1.759287 0.559389
H  -2.300652 -1.21558 1.569315
H  -1.556956 -2.673391 0.899363
H  -2.900662 -0.469814 -0.8056
H  -2.106236 -1.94894 -1.421136
H  0.618962 -2.66667 0.744942
H  -2.278685 0.800838 1.573065
H  1.041723 3.342568 -1.136861
H  2.598579 2.240151 -2.299625
H  1.064787 1.624293 -2.993214
H  2.529856 0.592988 -2.999558
H  4.203458 1.100071 -1.198663
H  2.833277 -2.789195 1.618643
H  -0.846264 4.551781 -0.044437
H  5.942797 -0.2831 -0.08271
H  5.264865 -2.240714 1.358327
H  -3.840823 -3.123575 -2.379957
H  -4.91765 -1.689166 -2.227149
H  -5.421239 -3.281983 -1.559924
H  -5.746791 -2.4143 0.641899
H  -5.21147 -0.736069 0.266442
H  -4.405038 -1.691529 1.56187
