program: Gaussian 09
title: 000207664
version: EM64L-G09RevD.01
frameworkgroup: C1[X(C15H25N3O)]
method: RPBEPBE
basis: SDD
operation: Freq
keyword: #p
keyword: freq=noraman
keyword: PBEPBE/SDD
title: #p freq=noraman PBEPBE/SDD
converged: YES YES NO NO
title: Mulliken charges:
elementType: O N N N C C C C C C C C C C C C C C C H H H H H H H H H H H H H H H H H H H H H H H H H
charge: -0.257434 -0.107697 -0.480032 -0.713203 -0.354962 -0.554357 -0.325152 -0.323456 0.208641 0.117870 -0.675195 -0.673687 0.423476 0.418693 -0.668966 -0.671954 0.578942 -0.835522 -0.840772 0.202164 0.243674 0.230050 0.224468 0.191541 0.208497 0.190090 0.203575 0.294318 0.225094 0.207149 0.206929 0.226043 0.207021 0.206391 0.222851 0.222259 0.214163 0.216024 0.287371 0.243396 0.220430 0.231918 0.305480 0.303872
chargesum: 0.00000
title: Mulliken charges with hydrogens summed into heavy atoms:
elementType: O N N N C C C C C C C C C C C C C C C
charge: -0.257434 -0.107697 -0.185714 -0.103852 0.090875 -0.099839 0.074886 0.070210 0.208641 0.117870 -0.036023 -0.034232 0.423476 0.418693 -0.446114 -0.449694 0.578942 -0.117965 -0.145029
polarizability: 2.71841806e+02 -5.69490562e+00 1.91975903e+02 -1.05152195e+01 -3.87977529e+00 1.27507225e+02
1716.lowfreq: -8.4501 -5.1201 0.0002 0.0006 0.0009 3.4061 15.4364 17.9984 34.7240
frequency: 12.8984 17.6818 34.7059 61.8858 65.7388 77.2292 83.8758 104.9075 118.2373 146.2446 150.4786 174.7438 187.4070 199.2855 213.6318 217.9507 231.4560 275.4383 287.5882 293.8873 307.2050 322.9136 336.0044 350.5079 365.6955 375.3015 410.1776 441.8694 465.5808 492.8788 502.5778 523.3766 553.5798 572.4658 581.9741 605.5164 621.0684 689.4518 721.4260 758.6205 775.7573 795.4940 799.9204 824.8853 847.4812 863.7995 909.9767 930.3802 954.2274 961.3425 985.5707 1024.0979 1033.4185 1038.9242 1042.3822 1044.1378 1052.8566 1056.3003 1071.4714 1074.3237 1083.7361 1098.9534 1141.4299 1168.9860 1195.2937 1206.7696 1235.9431 1248.8879 1260.6757 1275.3848 1281.8759 1290.1634 1312.9410 1358.6860 1363.7845 1368.9832 1374.6108 1384.5170 1386.0992 1386.8694 1396.3476 1397.7928 1442.8519 1447.6044 1454.7005 1455.1064 1461.3927 1463.1556 1467.7609 1470.4966 1471.1876 1478.3528 1485.8253 1486.7846 1490.2640 1494.1879 1504.8207 1594.2865 1616.9118 1634.0726 1643.8773 2854.3844 2863.7840 2921.1239 2963.7429 2976.8831 2980.5481 2981.8548 2988.4724 3023.4402 3032.8805 3034.4890 3041.4424 3057.0653 3059.3898 3072.6185 3074.5129 3084.4455 3087.3175 3089.5139 3089.8552 3113.7042 3118.2478 3508.4220 3569.1345 3709.9619
redmass: 4.1421 3.3199 4.2363 2.7782 3.6803 3.9919 2.0718 2.8502 2.8415 1.1262 1.8131 1.5343 1.4175 2.1075 2.3053 1.6922 2.4503 2.0041 2.5274 2.3774 2.8532 3.0354 2.9219 1.2997 1.0412 4.6331 3.3724 2.8778 2.8879 3.3205 3.9422 2.9397 2.2758 4.3873 2.5628 1.9364 3.2017 4.8434 2.5746 2.2749 1.4488 1.1547 1.3664 3.2897 1.3229 1.8500 2.1240 3.7285 2.4845 2.6905 2.3390 1.7117 1.8876 1.8421 2.7761 1.7092 1.5966 1.3988 2.6389 1.9848 2.1892 1.7521 1.7086 2.7838 1.9169 2.1573 1.7712 1.5508 1.5530 1.3041 1.1835 1.2240 1.4186 1.3322 1.3245 4.9343 1.3797 4.6916 1.2783 1.2340 1.2800 1.2675 1.1572 1.8509 1.5527 1.2026 1.0560 1.0527 1.3786 1.1997 1.0726 1.0530 1.0759 1.0694 1.0765 1.4792 1.7975 7.6213 5.4884 2.6408 1.5499 1.0722 1.0715 1.0688 1.0412 1.0362 1.0357 1.0357 1.0595 1.0873 1.0896 1.0910 1.0928 1.1004 1.0970 1.0984 1.0981 1.1000 1.0984 1.1003 1.1002 1.0910 1.0915 1.0760 1.0447 1.1040
irintensity: 0.7057 0.2756 0.9954 0.0422 1.8388 5.5388 0.1273 0.2973 1.7890 1.5875 1.2910 6.9550 1.8367 10.9683 5.5028 1.5816 1.2587 1.5327 0.3403 2.7375 3.3340 1.3716 10.4090 273.0264 1.0991 27.8719 4.7341 1.5258 8.9897 6.0403 7.0127 0.1592 17.4475 4.0288 24.8722 40.9212 4.2425 3.6367 7.7067 8.4796 4.9754 3.9516 10.7221 0.4468 1.0883 53.5780 2.4368 1.7499 4.1082 0.0496 9.9214 12.0995 10.2809 4.9865 2.3341 7.7780 16.1444 4.4864 68.7916 11.9561 3.0654 35.4781 38.1214 44.7416 23.6469 25.3581 22.5254 13.4578 38.0057 16.3212 1.7665 24.1854 65.0641 12.8648 9.3887 73.3597 2.2234 1.5619 22.5858 22.0214 36.6621 1.4345 16.4636 91.9662 12.1509 35.0396 0.9564 4.8816 89.1845 53.1051 4.1803 1.8548 15.3855 10.2496 11.6957 13.6014 144.6898 16.4864 132.0390 42.3515 343.1669 35.0585 169.6501 43.7666 37.4364 27.2593 33.4496 33.8202 18.3919 16.1815 13.1609 13.4400 20.9723 40.0359 12.3292 48.4371 84.2796 20.5583 23.0154 26.6050 59.1105 25.3137 28.9647 14.3871 76.4004 18.9080
temp: 298.150 k
press: 1.00000 atm
elementType: 8 7 7 7 6 6 6 6 6 6 6 6 6 6 6 6 6 6 6 1 1 1 1 1 1 1 1 1 1 1 1 1 1 1 1 1 1 1 1 1 1 1 1 1
symmnumber: 1
zpe: 993617.2 jmol-1
zpe.correction: 0.378449 hartree
zpe.thermalcorrener: 0.400666 hartree
zpe.thermalcorrenthalpy: 0.401610 hartree
zpe.thermalcorrgfe: 0.325297 hartree
zpe.sumelectzpe: -824.605514 hartree
zpe.sumelectthermal: -824.583297 hartree
zpe.sumelectthermalent: -824.582353 hartree
zpe.sumelectthermalfe: -824.658665 hartree
dipole: -1.7076 1.8728 -1.7568
dipole: 3.0838
quadrupole: -84.6189 -109.6655 -122.6333
quadrupole: -2.1953 -1.2577 2.3091
quadrupole: 21.0204 -4.0263 -16.9941 -2.1953 -1.2577 2.3091
hfenergy: -824.9839626 hartree
pointgroup: C01 [X(C15H25N3O1)]
dipole: 0.6661328 -0.731993 -0.7017214 debye
polarizability: 271.1474266|-7.9520208|192.0212318|12.759547|5.3723035|128.1562752 unknown
InChI: InChI=1S/C15H25N3O/c1-5-18(6-2)8-7-14(19)17-15-11(3)9-13(16)10-12(15)4/h9-10,17H,5-8,16H2,1-4H3
charge 0 multiplicity 1
44 atoms
O  -0.219073 1.231912 1.241214
N  -4.257373 0.118653 0.024637
N  0.57047 0.118661 -0.664935
N  6.103961 -0.280091 0.566872
C  -2.867508 0.050311 0.547273
C  -1.84347 0.591033 -0.481721
C  -4.862244 1.466423 0.211347
C  -5.123723 -0.980178 0.530421
C  -0.436507 0.679593 0.120007
C  1.972342 0.045507 -0.332769
C  -5.977533 1.774015 -0.806416
C  -4.837915 -2.330399 -0.154886
C  2.739875 1.225677 -0.112152
C  2.585482 -1.240089 -0.268332
C  4.11235 1.096491 0.192334
C  3.961307 -1.338109 0.022288
C  4.743034 -0.175065 0.267065
C  2.11579 2.602445 -0.207318
C  1.765938 -2.498299 -0.500054
H  -2.624061 -1.004675 0.768648
H  -2.742056 0.613922 1.500097
H  -2.144535 1.613004 -0.783511
H  -1.878075 -0.034764 -1.393035
H  -5.251016 1.596529 1.253235
H  -4.058824 2.216742 0.08923
H  -5.037287 -1.092722 1.641221
H  -6.173649 -0.70151 0.32668
H  0.26411 -0.378889 -1.504997
H  -5.583666 1.699015 -1.835027
H  -6.825464 1.071103 -0.715971
H  -6.372681 2.795317 -0.649807
H  -4.980167 -2.237516 -1.245727
H  -3.802792 -2.6736 0.026041
H  -5.520345 -3.112145 0.228573
H  4.70479 2.003469 0.367421
H  4.430829 -2.32857 0.075257
H  2.889074 3.388725 -0.243692
H  1.482294 2.693911 -1.109486
H  1.458159 2.784363 0.662293
H  0.866075 -2.513141 0.142365
H  1.417839 -2.583082 -1.549521
H  2.359348 -3.401814 -0.280856
H  6.657458 0.547971 0.763837
H  6.55434 -1.187533 0.633358
