program: Gaussian 09
title: 000207648
version: EM64L-G09RevD.01
frameworkgroup: C1[X(C22H28N2O)]
method: RPBEPBE
basis: SDD
operation: Freq
keyword: #p
keyword: freq=noraman
keyword: PBEPBE/SDD
title: #p freq=noraman PBEPBE/SDD
converged: YES YES NO NO
title: Mulliken charges:
elementType: O N N C C C C C C C C C C C C C C C C C C C C C C H H H H H H H H H H H H H H H H H H H H H H H H H H H H
charge: -0.257417 -0.037643 -0.233501 -0.026048 -0.480407 -0.498982 -0.446747 -0.522891 -0.352374 -0.568222 0.449058 0.210476 0.509115 -0.512712 -0.328283 -0.363548 -0.411240 -0.403166 -0.682338 -0.225195 -0.226368 -0.235249 -0.232807 -0.249607 -0.247276 0.258361 0.211259 0.244763 0.214510 0.225924 0.226160 0.221169 0.246605 0.226846 0.223914 0.181400 0.226626 0.211342 0.236467 0.229128 0.266331 0.231296 0.227840 0.233184 0.225973 0.237577 0.206729 0.227181 0.225299 0.226708 0.223821 0.229109 0.227849
chargesum: 0.00000
title: Mulliken charges with hydrogens summed into heavy atoms:
elementType: O N N C C C C C C C C C C C C C C C C C C C C C C
charge: -0.257417 -0.037643 -0.233501 0.232313 -0.024385 -0.058548 0.000583 -0.049440 0.052940 -0.130255 0.449058 0.210476 0.509115 -0.047116 -0.061952 -0.132253 -0.183400 -0.169981 -0.012060 0.001986 -0.001069 -0.008541 -0.008986 -0.020499 -0.019427
polarizability: 3.21219502e+02 -2.39781600e+01 2.37129759e+02 -2.59894167e+01 -7.40107769e+00 1.84121240e+02
1716.lowfreq: -5.4527 -3.2453 -0.0003 0.0002 0.0005 4.1841 15.3439 17.4952 27.7673
frequency: 13.2733 16.9099 27.7315 34.8802 39.9326 47.4752 49.8815 64.6662 77.5685 101.5218 121.3310 130.8395 147.2572 189.0851 202.3088 231.7361 238.4055 256.9395 280.1228 296.7894 329.1725 347.1073 364.0186 375.1966 387.1692 403.0804 403.6078 409.9347 430.3850 500.5007 508.9088 557.9386 565.3765 579.4104 602.5004 614.2603 618.1119 635.1258 658.0460 693.7984 705.6841 727.2945 754.6331 766.8103 789.2026 793.4762 803.8695 816.0227 827.6283 836.5480 839.8830 853.2916 866.9861 904.4764 908.5278 916.7743 925.1461 963.6774 964.5017 974.7408 987.1744 989.5900 989.7248 991.8097 993.0436 1004.5486 1016.5522 1026.2693 1026.4370 1040.6947 1051.2662 1065.6945 1070.9681 1080.7764 1081.1958 1088.1377 1095.6993 1108.4341 1118.8979 1160.2003 1171.7150 1172.8977 1180.7619 1186.9244 1189.7986 1214.3966 1216.4053 1219.0087 1230.3591 1259.9108 1264.8935 1276.0788 1289.4216 1293.9825 1295.9798 1301.2991 1319.6989 1321.2190 1323.7386 1328.4604 1335.6740 1342.3650 1361.8189 1368.8219 1381.9241 1382.3615 1392.6288 1440.0716 1440.2982 1449.8154 1462.0082 1464.3859 1468.0228 1471.7090 1477.0114 1479.2090 1482.7309 1483.3387 1484.5492 1491.8536 1580.6205 1592.1709 1594.6496 1612.0885 1614.0750 2860.1824 2967.2494 2979.0710 2980.4525 2987.9615 2995.0935 2995.8975 2997.0150 3017.5422 3019.2451 3026.0827 3058.7625 3061.5668 3063.6692 3074.4584 3091.6320 3106.3470 3106.5935 3112.6881 3114.6925 3126.1120 3130.4446 3136.0902 3141.7750 3149.1731 3161.0077 3164.0655 3192.5204
redmass: 5.1949 4.4408 3.9356 4.1659 4.6086 4.0774 4.1663 4.6272 4.0237 2.6995 1.6743 2.7524 2.8262 4.1137 1.2999 3.8355 3.5470 3.1230 3.3220 5.2225 2.3182 2.7396 3.0567 2.4951 4.4773 2.8329 2.8082 2.5976 2.4043 3.2429 3.0266 2.9810 4.7279 4.7318 2.5342 5.9889 6.3411 3.4960 4.4869 1.8700 1.7754 3.5631 1.8529 2.0669 2.6716 1.3763 3.3751 1.3693 2.1438 1.4925 3.1577 1.2475 1.9975 1.5674 1.5702 1.4964 2.2911 1.9037 1.3958 1.3920 1.9671 4.6836 2.4026 2.4645 1.3369 1.7401 2.1149 2.2421 2.1890 2.5709 2.9078 2.4349 1.5929 2.0371 2.2351 1.8089 2.1118 2.5875 1.7547 1.4466 1.0554 1.0552 1.3552 1.1195 1.1416 1.8009 2.6707 2.1477 1.4517 1.1860 1.3221 1.3934 1.4227 1.2095 1.4715 1.4449 1.3380 1.4126 1.2847 1.2737 1.3379 1.6070 1.3700 1.6809 7.7945 7.6493 1.2110 2.1707 2.2303 1.1107 1.0876 1.0426 1.0886 1.0863 1.0630 1.1167 1.4972 2.2315 1.4472 1.0869 7.1834 6.0283 6.7887 6.4236 6.1677 1.0692 1.0596 1.0704 1.0674 1.0629 1.0642 1.0370 1.0613 1.0993 1.0835 1.0878 1.1028 1.0992 1.1007 1.1016 1.0997 1.0921 1.0974 1.0871 1.0866 1.0847 1.0907 1.0888 1.0957 1.0940 1.1014 1.0997 1.0955
irintensity: 0.0154 0.0048 0.9582 0.1165 0.1544 0.1090 1.4067 2.0407 0.7655 1.3342 0.8183 0.3513 0.2072 0.1452 0.6960 1.0139 1.3893 1.1206 4.8166 3.1371 0.1824 3.3769 4.3256 7.8625 4.8196 1.3955 0.4798 0.2695 4.1332 7.0256 19.6356 1.5299 10.5218 4.5742 4.2433 1.0420 0.2664 7.5247 3.6285 46.7677 52.4295 12.1512 35.9698 50.8725 2.1191 1.4619 3.8988 14.7943 3.5366 0.4198 11.2675 0.8527 10.3326 2.8017 5.8904 5.6562 3.6597 15.7078 0.2993 0.2234 0.2517 0.3256 0.0976 4.0191 0.2436 2.8944 9.3587 12.8892 3.3699 14.5386 48.4142 50.2669 1.2723 13.3090 1.4198 7.5236 30.1633 10.4484 9.5311 60.6894 0.2569 0.5033 22.9794 0.9737 1.5904 30.9521 18.2536 11.0392 57.0273 0.8985 13.1765 40.7364 2.7860 0.9770 0.6749 15.8103 1.9851 5.6342 0.3166 0.2763 5.2009 91.0689 3.1557 79.2410 0.2618 2.1782 29.6500 8.1102 8.5831 12.1840 2.5535 16.2883 3.8794 9.2002 25.6015 6.1230 15.2013 78.4300 5.6550 7.5175 123.4605 1.2237 42.8537 59.7491 7.4961 79.8526 25.6688 15.0561 64.1015 52.0250 2.6379 30.0793 45.0734 14.6292 20.7009 13.8234 17.1059 13.4312 67.4972 53.2099 29.1775 21.2336 45.9349 8.0579 11.8244 2.3887 12.8319 7.4324 47.4153 34.8044 23.7890 27.0844 1.4969
temp: 298.150 k
press: 1.00000 atm
elementType: 8 7 7 6 6 6 6 6 6 6 6 6 6 6 6 6 6 6 6 6 6 6 6 6 6 1 1 1 1 1 1 1 1 1 1 1 1 1 1 1 1 1 1 1 1 1 1 1 1 1 1 1 1
symmnumber: 1
zpe: 1184345.7 jmol-1
zpe.correction: 0.451093 hartree
zpe.thermalcorrener: 0.475045 hartree
zpe.thermalcorrenthalpy: 0.475989 hartree
zpe.thermalcorrgfe: 0.393473 hartree
zpe.sumelectzpe: -1037.999409 hartree
zpe.sumelectthermal: -1037.975457 hartree
zpe.sumelectthermalent: -1037.974513 hartree
zpe.sumelectthermalfe: -1038.057029 hartree
dipole: 0.6507 3.3904 -2.5143
dipole: 4.2708
quadrupole: -142.6576 -156.3094 -147.5849
quadrupole: -11.1096 -3.2231 -2.0387
quadrupole: 6.1930 -7.4588 1.2658 -11.1096 -3.2231 -2.0387
hfenergy: -1038.4505025 hartree
pointgroup: C01 [X(C22H28N2O1)]
dipole: -0.3405213 0.8229515 1.4247916 debye
polarizability: 305.2867665|47.3182022|238.9586113|-24.3862469|18.1885697|198.2251228 unknown
InChI: InChI=1S/C22H28N2O/c1-2-22(25)24(21-11-7-4-8-12-21)18-20-14-16-23(17-20)15-13-19-9-5-3-6-10-19/h3-12,20H,2,13-18H2,1H3
charge 0 multiplicity 1
53 atoms
O  2.317557 -2.336955 -1.257725
N  -1.13385 2.181621 0.557566
N  2.219762 -0.619365 0.33048
C  1.164965 1.516663 1.214698
C  0.173275 1.713184 0.004288
C  0.416339 2.140121 2.43651
C  -0.749471 2.941936 1.780284
C  1.545653 0.038403 1.482821
C  -2.130167 1.102542 0.781435
C  -2.859671 0.713939 -0.53455
C  3.456283 -0.020114 -0.133425
C  1.727246 -1.795532 -0.27588
C  -3.889329 -0.382721 -0.308445
C  0.449133 -2.423872 0.314763
C  3.712469 0.145859 -1.518614
C  4.416579 0.432116 0.807501
C  -3.588183 -1.742145 -0.581507
C  -5.168179 -0.070925 0.223862
C  0.036547 -3.695648 -0.448766
C  4.912641 0.751655 -1.946999
C  5.612418 1.043493 0.371273
C  -4.533526 -2.762484 -0.328047
C  -6.117052 -1.085842 0.478961
C  5.86823 1.206366 -1.008813
C  -5.801955 -2.437764 0.205319
H  2.094274 2.081102 1.015791
H  0.041778 0.787608 -0.583886
H  0.574691 2.481166 -0.682314
H  0.008089 1.34467 3.09079
H  1.07319 2.776729 3.055022
H  -1.618881 3.084589 2.444312
H  -0.385439 3.942753 1.474402
H  0.635274 -0.527378 1.726819
H  2.196256 -0.014279 2.378655
H  -2.881667 1.4767 1.501765
H  -1.690618 0.177078 1.231664
H  -3.33121 1.63153 -0.931951
H  -2.110743 0.387872 -1.281145
H  0.618349 -2.666737 1.383187
H  -0.382163 -1.690536 0.293886
H  2.985653 -0.213197 -2.249646
H  4.244688 0.295091 1.8803
H  -2.61179 -2.002542 -1.0102
H  -5.423407 0.976752 0.429002
H  -0.144511 -3.475998 -1.514643
H  0.835436 -4.454296 -0.409296
H  -0.883479 -4.121386 -0.008047
H  5.099386 0.869232 -3.020245
H  6.345221 1.38358 1.111632
H  -4.284098 -3.805887 -0.552961
H  -7.101658 -0.824524 0.883631
H  6.797422 1.676834 -1.348113
H  -6.538056 -3.22616 0.398702
