program: Gaussian 09
title: 000207606
version: EM64L-G09RevD.01
frameworkgroup: C1[X(C11H11FN2O4S)]
method: RPBEPBE
basis: SDD
operation: Freq
keyword: #p
keyword: freq=noraman
keyword: PBEPBE/SDD
title: #p freq=noraman PBEPBE/SDD
converged: YES YES NO NO
title: Mulliken charges:
elementType: S F O O O O N N C C C C C C C C C C C H H H H H H H H H H H
charge: 0.953260 -0.169451 -0.172123 -0.181674 -0.530049 -0.530945 -0.328658 -0.716285 -0.164465 -0.541156 0.152822 0.150459 0.340371 -0.704337 0.272530 -0.277915 -0.019254 -0.364937 -0.237466 0.278049 0.264119 0.270268 0.218896 0.226786 0.255629 0.274018 0.316799 0.285716 0.335378 0.343618
chargesum: 0.00000
title: Mulliken charges with hydrogens summed into heavy atoms:
elementType: S F O O O O N N C C C C C C C C C C C
charge: 0.953260 -0.169451 -0.172123 -0.181674 -0.530049 -0.530945 -0.328658 -0.037290 0.113584 -0.006769 0.152822 0.150459 0.340371 -0.003027 0.272530 -0.003897 -0.019254 -0.048139 0.048251
polarizability: 2.40664182e+02 -7.76975001e-01 1.58179494e+02 5.23716117e+00 6.20521491e+00 1.18842215e+02
1716.lowfreq: -6.7524 -1.8452 0.0009 0.0016 0.0016 3.6086 24.7750 34.8987 45.1510
frequency: 24.6646 34.8927 45.1404 57.1474 76.6523 99.0243 112.9489 126.2283 148.1201 168.5701 186.3740 213.5660 227.9161 241.6695 259.3863 279.2052 303.5083 320.0787 328.1933 355.5628 385.4480 419.3096 443.4331 458.8976 471.1001 516.5020 525.8213 568.8024 570.2653 578.5453 613.4854 618.9116 673.6702 724.5048 734.1309 786.1167 799.6514 827.8901 831.6943 863.9708 895.0299 907.8896 912.8065 930.8321 961.1797 977.6217 1044.9014 1055.6605 1074.0411 1084.6613 1110.9583 1131.6057 1148.1744 1165.4937 1187.5151 1200.1308 1244.2531 1256.6115 1282.8126 1307.5121 1341.2339 1390.5226 1394.6558 1403.2253 1443.4691 1474.0480 1480.0554 1482.3892 1534.8488 1597.6066 1602.3957 1646.1350 1705.6924 2991.9691 2994.4618 3017.3675 3086.1444 3090.2768 3103.3814 3168.3937 3171.0071 3188.6095 3372.2125 3540.4924
redmass: 6.7908 5.1455 4.3162 6.5703 3.5587 4.5049 3.0238 2.6808 9.5159 8.2851 5.9156 1.0582 7.0585 4.3434 3.2505 4.8968 6.9020 4.9469 8.0629 3.5684 6.4197 6.5661 7.7617 3.4384 3.5110 4.7364 6.1180 6.2819 4.2423 4.7247 4.0272 7.7279 6.4281 4.0822 3.5923 1.7971 9.7113 2.3745 2.1627 4.3122 1.4963 1.5978 3.9425 2.5090 1.4992 2.7081 1.9902 1.8693 1.5390 2.4492 2.9887 1.9812 2.6571 2.0528 1.5681 3.0059 1.4180 1.3745 1.4422 1.7818 4.2105 10.7885 1.1968 4.1816 1.0844 1.0498 1.0519 3.2582 1.0853 8.9042 7.6235 12.2541 12.4960 1.0461 1.0721 1.0641 1.0995 1.0997 1.1002 1.0898 1.0931 1.0972 1.0414 1.1006
irintensity: 0.5366 1.3875 0.2529 1.4317 2.8325 10.9520 6.1632 32.8234 0.7972 1.1986 1.0848 0.2975 2.7392 1.0539 5.2961 6.9022 10.0844 4.3615 27.8413 2.6821 4.5112 8.7044 59.9078 20.0223 151.1485 5.4971 0.1782 13.8207 6.6378 11.7302 27.1601 34.4081 5.6864 16.8425 1.2383 151.9244 52.5303 70.9687 20.4454 25.8605 24.9676 7.0510 55.7905 3.4746 0.6647 3.5691 14.5307 25.8799 22.9452 49.7058 22.0283 21.7003 186.6260 55.6049 12.8150 32.3073 22.0381 8.1914 6.8358 0.4033 306.7229 6.2353 22.0828 36.8195 17.0850 16.6391 9.4361 179.4698 25.3692 25.2062 2.5991 455.1731 0.8819 14.3353 16.4282 5.7038 3.8077 29.1400 11.9699 1.3478 15.1331 3.8220 33.7865 28.4010
temp: 298.150 k
press: 1.00000 atm
elementType: 16 9 8 8 8 8 7 7 6 6 6 6 6 6 6 6 6 6 6 1 1 1 1 1 1 1 1 1 1 1
symmnumber: 1
zpe: 551007.6 jmol-1
zpe.correction: 0.209868 hartree
zpe.thermalcorrener: 0.228873 hartree
zpe.thermalcorrenthalpy: 0.229817 hartree
zpe.thermalcorrgfe: 0.161122 hartree
zpe.sumelectzpe: -1332.521542 hartree
zpe.sumelectthermal: -1332.502536 hartree
zpe.sumelectthermalent: -1332.501592 hartree
zpe.sumelectthermalfe: -1332.570287 hartree
dipole: -4.5944 -0.6560 3.1803
dipole: 5.6261
quadrupole: -100.5090 -130.3304 -118.2631
quadrupole: -10.9368 15.0965 5.4215
quadrupole: 15.8585 -13.9629 -1.8956 -10.9368 15.0965 5.4215
hfenergy: -1332.7314093 hartree
pointgroup: C01 [X(C11H11F1N2O4S1)]
dipole: -1.8341982 -0.2620392 1.2109794 debye
polarizability: 240.3818662|-1.0054584|158.1258156|7.8469791|6.3526622|119.1782094 unknown
InChI: InChI=1S/C11H11FN2O4S/c1-6-4-10(15)14(11(6)16)9-3-2-7(5-8(9)12)19(13,17)18/h2-3,5-6H,4,13H2,1H3
charge 0 multiplicity 1
30 atoms
S  4.29472 0.03209 0.120814
F  -0.361719 -1.699085 -1.493273
O  -2.20822 -1.890092 0.764328
O  -2.055691 2.534345 -0.810565
O  4.761451 -0.961903 -1.081604
O  4.860392 1.544497 0.316556
N  -1.793182 0.281008 -0.103523
N  4.607678 -0.811113 1.720294
C  -4.079251 -0.455538 -0.076985
C  -4.029862 1.060798 -0.391704
C  -2.628233 -0.830736 0.258301
C  -2.550971 1.434128 -0.486462
C  -0.366668 0.246432 -0.045593
C  -5.055354 -0.875062 1.041009
C  0.346011 -0.775781 -0.718286
C  0.361939 1.237254 0.653398
C  2.41212 0.120368 0.061399
C  1.743581 -0.87289 -0.667736
C  1.769709 1.18542 0.710674
H  -4.332127 -1.019844 -0.997041
H  -4.489062 1.660351 0.416179
H  -4.537053 1.341377 -1.329403
H  -4.859377 -0.311939 1.9714
H  -6.098929 -0.685285 0.73496
H  -4.9439 -1.949574 1.263723
H  -0.179951 2.048962 1.144681
H  2.283037 -1.658066 -1.205958
H  2.348924 1.954317 1.229422
H  4.920925 -1.778484 1.538085
H  5.293463 -0.246155 2.247809
