program: Gaussian 09
title: 000016547
version: EM64L-G09RevD.01
frameworkgroup: C1[X(C10H10O5)]
method: RPBEPBE
basis: SDD
operation: Freq
keyword: #pfreq=noraman
keyword: PBEPBE/SDD
title: #p freq=noraman PBEPBE/SDD
converged: NO YES NO NO
title: Mulliken charges:
elementType: O O O O O C C C C C C C C C C H H H H H H H H H H
charge: -0.404400 -0.375924 -0.428757 -0.345630 -0.343568 0.023066 0.027945 0.086998 0.212059 0.235228 -0.607343 0.233287 0.246207 -0.733801 -0.731204 0.252123 0.252020 0.249557 0.252265 0.256969 0.244830 0.257124 0.383891 0.380413 0.376645
chargesum: 0.00000
title: Mulliken charges with hydrogens summed into heavy atoms:
elementType: O O O O O C C C C C C C C C C
charge: -0.020509 0.004489 -0.052112 -0.345630 -0.343568 0.023066 0.027945 0.086998 0.212059 0.235228 -0.355221 0.233287 0.246207 0.020041 0.027720
polarizability: 2.00865933e+02 4.00018287e+00 1.52431101e+02 -4.61369278e-02 1.71580374e-02 6.00759393e+01
1716.lowfreq: -5.5998 0.0008 0.0009 0.0010 5.8432 7.0189 61.8391 63.2885 122.4377
frequency: 61.8351 63.2785 122.4371 140.8922 178.3920 185.5219 212.7002 218.7794 256.0207 291.8401 312.9338 329.4029 351.4535 373.5925 395.5662 422.6874 451.0808 462.8017 552.0332 565.6230 575.4263 586.5567 602.1104 625.1565 649.0727 675.2620 688.9327 762.6465 803.8009 823.5118 961.4490 981.4449 1029.6817 1031.9076 1044.2706 1065.3421 1085.2885 1102.7319 1148.1530 1160.6374 1185.2452 1215.6226 1241.0311 1309.2453 1342.3975 1382.6827 1385.0525 1388.9590 1405.1485 1411.8844 1433.5185 1436.8276 1446.0623 1452.2522 1483.8688 1539.5942 1579.7957 1613.2172 1638.3662 2056.6580 2250.2090 3003.1939 3005.7975 3087.0239 3092.4536 3129.7382 3130.8877 3152.0830 3563.2456
redmass: 4.1170 4.0838 7.0135 6.0610 1.1502 1.0658 4.4926 5.0338 5.3499 3.5888 6.5171 4.7904 5.3966 6.0249 4.9053 6.1870 1.1456 5.8520 7.8722 3.1379 3.6750 6.6821 6.3165 3.1701 4.1288 3.9642 6.3464 3.8782 5.5465 2.0402 2.1959 1.9348 1.7400 1.7054 4.8910 3.1339 3.6028 1.0600 1.0590 2.6604 1.6642 2.1866 1.9627 3.8056 5.3618 2.3977 1.3270 1.5083 2.5591 3.7397 1.4952 1.0475 1.0470 1.5433 2.6883 3.7811 3.0783 2.8801 2.9697 1.0965 1.0844 1.0362 1.0362 1.0945 1.0955 1.1030 1.1025 1.0924 1.0658
irintensity: 0.0005 4.2858 1.1414 0.0587 1.7818 0.2681 11.8755 0.0089 1.6565 6.7767 3.1247 10.2931 4.4244 4.4524 7.5170 2.2060 116.3387 6.7540 13.1184 0.3000 2.4024 27.5145 56.5327 13.6606 30.6440 15.0137 0.3251 3.7551 5.6425 48.5561 27.5396 19.8340 13.7896 8.0464 98.4473 11.8563 33.3851 121.8320 130.3077 173.1035 22.2748 47.1137 134.6759 188.6074 107.0584 18.3264 42.1639 167.7434 17.7864 4.3067 145.5416 17.7177 18.0562 12.9869 189.0874 146.2948 113.6008 325.8900 1224.8762 491.5257 575.1351 0.9479 0.3859 3.6029 4.8971 21.4600 16.0469 2.9701 62.7568
temp: 298.150 k
press: 1.00000 atm
elementType: 8 8 8 8 8 6 6 6 6 6 6 6 6 6 6 1 1 1 1 1 1 1 1 1 1
symmnumber: 1
zpe: 476797.5 jmol-1
zpe.correction: 0.181603 hartree
zpe.thermalcorrener: 0.195246 hartree
zpe.thermalcorrenthalpy: 0.196190 hartree
zpe.thermalcorrgfe: 0.141890 hartree
zpe.sumelectzpe: -762.115796 hartree
zpe.sumelectthermal: -762.102153 hartree
zpe.sumelectthermalent: -762.101209 hartree
zpe.sumelectthermalfe: -762.155509 hartree
dipole: -3.3513 2.2097 0.0176
dipole: 4.0142
quadrupole: -92.5304 -83.7126 -87.5013
quadrupole: -15.5050 0.0234 0.0131
quadrupole: -4.6156 4.2022 0.4135 -15.5050 0.0234 0.0131
hfenergy: -762.297399 hartree
pointgroup: C01 [X(C10H10O5)]
dipole: -1.3939469 -0.7415479 -0.0350561 debye
dipolederiv: -0.7243589 -0.0176446 0.0273871 0.127014 -1.0403413 -0.1404985 0.0538712 -0.1293779 -0.3638031 -1.2305806 0.3533746 0.1304934 0.3002175 -0.8197006 -0.1037348 0.1201334 -0.1085023 -0.4018908 -1.1991881 -0.5804402 -0.0444478 -0.519442 -0.478697 0.0182034 -0.0338086 0.0225659 -0.3583222 -0.7590251 -0.0722709 0.019254 0.4422441 -1.1727658 -0.1879223 0.1144291 -0.1474955 -0.378265 -1.2564861 0.0382527 0.0766521 0.2739867 -0.7275537 -0.0891547 0.1195147 -0.0712049 -0.3689624 -1.2719107 0.2560478 0.137547 0.2443448 -0.8738623 -0.1601282 0.135504 -0.162044 -0.1507607 -1.2631143 -0.0373068 0.0824217 -0.3100464 -0.8205058 -0.1040217 0.0323183 -0.1249478 -0.1438695 1.1555563 -0.0553401 -0.0882173 -0.0711251 0.9340827 0.1506233 -0.0897101 0.1499406 0.1861768 1.4119825 -0.3752243 -0.1633763 0.1615135 0.8863713 0.1211326 -0.0657834 0.161728 0.1901471 1.4539928 0.2919184 -0.0454271 -0.1938551 1.0980207 0.1944895 -0.1341098 0.1575163 0.1708241 -1.2622312 0.1673416 0.106704 0.1059806 -0.1296398 0.0173026 0.0951882 0.0125127 -0.2726642 1.5074712 -0.3675656 -0.1741365 -0.6732997 1.2187266 0.249492 -0.2303951 0.2251371 0.2120456 1.8276482 0.2274674 -0.0875972 0.299087 0.8764105 0.1034265 -0.0742438 0.1100892 0.1885088 -0.4925095 -0.0927735 0.0213209 -0.281242 0.006352 0.0226498 -0.0142294 0.0081395 0.0044995 0.0506274 -0.024532 -0.009912 -0.2327781 -0.4782013 -0.0661646 -0.049132 -0.0836915 -0.0223825 0.04517 -0.0520967 0.0014325 -0.050739 -0.0371533 -0.0384452 0.0011495 -0.038273 0.1846355 0.080965 0.014261 -0.0084622 0.011033 0.0446451 0.0964928 0.0138197 0.0857961 0.0320829 0.0208623 0.0500106 0.01711 0.1411443 -0.0297495 -0.0388542 0.0340461 -0.0317589 0.1119227 0.0790312 0.0007777 -0.0011205 0.004061 0.1046578 -0.0699103 -0.0231155 -0.0592814 -0.0252888 0.0687259 0.0212406 -0.0805751 0.0156339 0.077211 0.0468518 -0.0606416 0.0575034 0.0352379 -0.1269365 -0.0695334 0.0083513 0.014008 0.0926263 -0.0057979 0.0237938 0.0017089 0.1177878 0.0909845 -0.0138146 0.06917 -0.0104083 0.1057193 -0.0169216 0.0494369 -0.0270377 -0.0153605 0.8096228 0.0081474 -0.0351452 -0.1350521 0.4035566 0.0220841 -0.0611261 0.0109587 0.3477895 0.6449557 0.1540746 0.0052359 0.1861121 0.588945 0.0282876 0.0121882 0.030999 0.3568852 0.3387451 0.1756282 0.0353373 0.1516073 0.1708453 -0.0494821 0.0309024 -0.0509804 0.3630264 unknown
polarizability: 198.8142772|-6.5801653|150.4081826|-11.9397397|17.1282119|64.1505134 unknown
InChI: InChI=1S/C10H10O5/c1-4(11)8-6(13)3-7(14)9(5(2)12)10(8)15/h3,13-15H,1-2H3
charge 0 multiplicity 1
25 atoms
O  0.412161 2.031923 0.703815
O  2.253049 -2.352299 -0.243132
O  -2.494718 -1.81499 0.212299
O  -1.968803 2.315774 0.94039
O  3.761888 -0.445966 -0.011532
C  -1.090591 0.146778 0.470773
C  1.414637 -0.107235 0.230951
C  0.256872 0.70519 0.470213
C  1.204273 -1.522956 -0.012038
C  -1.210664 -1.26466 0.217919
C  -0.098018 -2.078894 -0.01658
C  -2.213498 1.047116 0.725671
C  2.792335 0.397856 0.2146
C  -3.661942 0.625245 0.760921
C  3.164785 1.839654 0.442086
H  -0.195662 -3.15273 -0.207548
H  -3.832912 -0.14788 1.529479
H  -4.274211 1.514781 0.973814
H  -3.967657 0.172201 -0.197583
H  2.664901 2.496841 -0.29026
H  4.258857 1.934799 0.365913
H  2.813214 2.187315 1.429126
H  -0.601493 2.432653 0.855346
H  3.132119 -1.727517 -0.195395
H  -2.454321 -2.787598 0.028453
