program: Gaussian 09
title: 000207599
version: EM64L-G09RevD.01
frameworkgroup: C1[X(C21H21NO)]
method: RPBEPBE
basis: SDD
operation: Freq
keyword: #p
keyword: freq=noraman
keyword: PBEPBE/SDD
title: #p freq=noraman PBEPBE/SDD
converged: YES YES NO NO
title: Mulliken charges:
elementType: O N C C C C C C C C C C C C C C C C C C C C C H H H H H H H H H H H H H H H H H H H H H
charge: -0.254715 -0.222939 -0.188413 0.334038 0.098989 0.418934 0.209690 0.331196 0.491011 -0.422339 -0.382882 -0.689304 -0.692195 -0.446345 -0.378462 -0.345436 -0.437099 -0.362672 -0.382819 -0.667530 -0.427414 -0.251111 -0.237946 0.205833 0.218489 0.234268 0.238787 0.223461 0.225489 0.244696 0.220897 0.204446 0.248136 0.240804 0.290344 0.230377 0.232750 0.229664 0.241583 0.253629 0.232573 0.243595 0.222772 0.223168
chargesum: 0.00000
title: Mulliken charges with hydrogens summed into heavy atoms:
elementType: O N C C C C C C C C C C C C C C C C C C C C C
charge: -0.254715 -0.222939 0.017420 0.334038 0.098989 0.418934 0.209690 0.331196 0.491011 -0.203850 -0.148613 -0.001567 -0.022155 -0.198209 -0.137658 -0.055093 -0.206722 -0.129922 -0.153155 0.060254 -0.183819 -0.028339 -0.014778
polarizability: 5.64795448e+02 1.68118015e+01 2.29758836e+02 -9.69811082e+00 9.42381785e+00 1.24132572e+02
1716.lowfreq: -5.5218 -1.0569 -0.0010 -0.0006 0.0008 3.4119 17.5979 23.4466 31.3031
frequency: 17.4704 23.4418 31.2927 38.4867 70.0000 71.0309 92.1249 132.5521 156.3449 168.6300 181.1684 201.0175 207.7158 217.9671 234.9855 246.5208 257.0567 304.9704 321.7291 338.5340 380.8600 394.4171 400.7021 410.6420 429.0329 438.6698 442.7227 523.6158 535.7603 563.6450 567.3172 594.1087 619.8083 638.2638 656.2801 698.9181 706.5521 715.7765 729.9318 751.4223 760.9723 789.9014 796.7712 802.8687 819.0480 832.8178 844.7665 853.0587 878.5559 896.5217 911.9206 926.2334 929.5366 943.4391 954.5563 964.5995 966.7166 978.7319 1003.9113 1016.9156 1029.8275 1061.3006 1075.8124 1081.7614 1096.3230 1112.9679 1115.6507 1122.2749 1138.9596 1168.2183 1183.4780 1193.8825 1203.2688 1209.2673 1225.9180 1258.5042 1271.9853 1280.9416 1295.6664 1320.1582 1325.5306 1350.0487 1361.9716 1378.1289 1392.4932 1396.9617 1413.1962 1428.7682 1444.7182 1445.7345 1457.6705 1459.1050 1467.5624 1476.7710 1482.3467 1487.6598 1497.1184 1503.7231 1514.1341 1555.7787 1581.4215 1593.3609 1610.4854 1614.5090 1633.8041 2979.7923 2983.7947 2991.2707 3001.5006 3070.7120 3077.0015 3079.3572 3086.2830 3087.1974 3107.6078 3118.4844 3122.3900 3127.3445 3141.0399 3141.3603 3160.1702 3164.1366 3172.2634 3176.5758 3213.2587 3218.6832
redmass: 4.0640 4.4299 4.0965 4.8933 3.7083 4.0915 3.5898 5.4337 3.6630 1.8010 1.5519 1.2800 2.5374 1.3015 3.0983 4.1549 3.2779 3.5640 3.4916 3.7193 3.6007 4.3640 3.2253 3.0519 2.8022 3.6810 3.5840 2.7076 6.0078 4.2033 3.6415 4.5717 5.1769 6.0676 2.5798 5.6223 3.9881 4.8259 3.1801 2.7909 1.3289 4.3746 3.6505 1.7524 1.3178 2.2547 2.7084 4.7027 1.4854 2.4007 1.5606 1.1936 1.3405 1.4503 1.4203 1.4072 1.3682 1.3313 3.0521 2.5883 2.3692 2.0232 1.7541 1.5123 2.4864 1.5461 1.3389 2.1291 1.5459 1.0971 2.0274 2.1196 1.4881 1.5082 2.8545 1.8831 1.6766 1.9825 2.2155 1.5402 1.5747 1.8301 3.3135 1.2169 2.7653 1.2536 2.7050 3.0633 1.1768 2.6042 3.6201 1.0582 1.0510 1.0504 1.0502 1.0582 1.0806 2.6803 4.1828 6.5257 8.4353 6.6178 6.5650 7.1531 7.3281 1.0439 1.0348 1.0390 1.0794 1.0948 1.0871 1.1000 1.1002 1.1003 1.0996 1.0858 1.0891 1.0887 1.0943 1.0954 1.1001 1.0935 1.0899 1.0916 1.0947 1.1004
irintensity: 1.2320 1.3749 0.7432 1.3725 0.3210 0.4011 1.5748 0.5142 0.9228 0.2454 0.2990 1.6273 2.7117 1.4608 2.2431 1.0858 1.6536 0.9644 2.9230 16.0189 1.4155 0.9574 2.4853 6.7530 1.3680 8.2205 8.2619 22.5732 2.7381 9.7805 2.4295 7.0013 6.2811 0.8785 1.3894 10.8375 2.9358 5.2810 7.1733 9.3268 84.1154 6.4587 2.8588 29.6548 11.1585 30.2545 29.7622 10.7452 1.1334 0.5525 22.9665 5.8129 0.9514 5.6744 2.6438 1.9352 1.1196 0.1156 0.9543 18.2650 10.5253 382.0149 10.9831 25.1762 3.7233 0.4211 3.1608 14.2572 12.5157 7.8396 19.6273 2.8849 59.1071 4.5789 41.4805 14.9846 79.1790 3.7210 296.9923 5.6816 42.3371 119.2085 5.6431 19.3899 20.0801 56.6962 5.1662 6.5011 20.0155 25.6431 123.0668 5.7790 6.1536 5.5084 32.3569 9.0549 103.6038 119.9941 65.7942 7.0991 171.7826 1.6795 77.9346 72.6401 15.9050 43.6741 46.2953 43.4774 24.7499 22.7170 17.0457 36.5005 23.4431 52.0820 26.6817 3.7846 14.7438 1.7396 33.1887 24.2848 59.1795 24.2406 4.2115 3.6176 0.4070 8.5175
temp: 298.150 k
press: 1.00000 atm
elementType: 8 7 6 6 6 6 6 6 6 6 6 6 6 6 6 6 6 6 6 6 6 6 6 1 1 1 1 1 1 1 1 1 1 1 1 1 1 1 1 1 1 1 1 1
symmnumber: 1
zpe: 944587.6 jmol-1
zpe.correction: 0.359774 hartree
zpe.thermalcorrener: 0.380920 hartree
zpe.thermalcorrenthalpy: 0.381864 hartree
zpe.thermalcorrgfe: 0.307691 hartree
zpe.sumelectzpe: -941.175199 hartree
zpe.sumelectthermal: -941.154054 hartree
zpe.sumelectthermalent: -941.153110 hartree
zpe.sumelectthermalfe: -941.227282 hartree
dipole: -3.6330 -3.2020 2.1166
dipole: 5.2850
quadrupole: -112.8672 -124.5657 -143.0604
quadrupole: 11.8442 -9.8248 4.2412
quadrupole: 13.9639 2.2654 -16.2293 11.8442 -9.8248 4.2412
hfenergy: -941.5349735 hartree
pointgroup: C01 [X(C21H21N1O1)]
dipole: 1.4388111 -1.0473098 1.0753705 debye
polarizability: 564.7876085|-19.8939746|124.3964338|6.6482772|-7.480531|229.5028144 unknown
InChI: InChI=1S/C21H21NO/c1-15(2)21(23)22(3)19-12-8-16(9-13-19)14-18-11-10-17-6-4-5-7-20(17)18/h4-15H,1-3H3
charge 0 multiplicity 1
44 atoms
O  4.265765 0.97954 -1.458775
N  3.965977 -0.618344 0.230393
C  6.293318 -0.143837 -0.699733
C  -2.813364 -0.099585 -0.20604
C  -4.246596 0.094275 0.156781
C  2.537961 -0.431471 0.31244
C  4.768274 0.11113 -0.684755
C  -5.022753 -0.005223 -1.047211
C  -0.330968 -0.192052 0.520565
C  -1.778707 -0.087316 0.710946
C  -2.799677 -0.326042 -1.666403
C  6.970837 0.677908 0.43463
C  6.87252 0.247854 -2.07741
C  -4.093014 -0.276402 -2.155727
C  1.871281 -0.654472 1.550007
C  1.749635 -0.062525 -0.816419
C  0.475712 -0.52603 1.647584
C  0.354605 0.049805 -0.70864
C  -4.877891 0.349419 1.387863
C  4.559257 -1.523892 1.242251
C  -6.423858 0.14544 -1.016085
C  -6.289203 0.497393 1.418238
C  -7.053724 0.396866 0.229344
H  6.507252 -1.217699 -0.537977
H  -2.081113 -0.002111 1.766466
H  -1.913627 -0.555947 -2.257008
H  6.770608 1.754378 0.288222
H  8.064897 0.525353 0.409906
H  6.609012 0.39652 1.439839
H  6.645017 1.302243 -2.304948
H  6.439105 -0.366943 -2.885816
H  7.968733 0.10618 -2.077974
H  -4.392219 -0.429778 -3.195372
H  2.437648 -0.909019 2.450123
H  2.23706 0.158505 -1.76517
H  -0.007517 -0.697195 2.617397
H  -0.20609 0.37452 -1.58855
H  -4.302658 0.436712 2.317318
H  5.545461 -1.876393 0.915837
H  3.908561 -2.404381 1.374549
H  4.682199 -1.025412 2.223073
H  -7.018638 0.072117 -1.933636
H  -6.794093 0.692832 2.370961
H  -8.14208 0.516879 0.275718
