program: Gaussian 09
title: 000207592
version: EM64L-G09RevD.01
frameworkgroup: C1[X(C7H7N3O4)]
method: RPBEPBE
basis: SDD
operation: Freq
keyword: #pfreq=noraman
keyword: PBEPBE/SDD
title: #p freq=noraman PBEPBE/SDD
converged: YES YES NO NO
title: Mulliken charges:
elementType: O O O O N N N C C C C C C C H H H H H H H
charge: -0.328229 -0.323351 -0.361956 -0.360742 -0.061613 -0.331398 -0.314376 0.323853 0.051515 -0.275155 -0.250494 -0.500612 0.201603 0.224071 0.290393 0.288795 0.251645 0.343299 0.365529 0.384628 0.382597
chargesum: 0.00000
title: Mulliken charges with hydrogens summed into heavy atoms:
elementType: O O O O N N N C C C C C C C
charge: -0.328229 -0.323351 0.022672 0.021854 -0.061613 0.011901 0.051153 0.323853 0.051515 0.015238 0.038301 -0.248967 0.201603 0.224071
polarizability: 2.18021669e+02 -1.76650400e-01 1.17660919e+02 -2.97306866e-01 -4.34158940e-01 4.53423585e+01
1716.lowfreq: -6.5380 -2.6183 -0.0010 -0.0009 0.0001 5.6131 40.3552 52.4965 85.9413
frequency: 40.3533 52.4946 85.9406 93.7408 136.1352 159.7768 198.1008 243.9243 272.3162 286.5867 296.4257 374.8405 403.6829 425.7467 440.9101 469.2162 492.9991 512.1056 523.8105 578.3174 629.9992 668.1578 695.4763 723.7137 788.0561 865.1208 879.2739 890.2762 926.1084 980.7665 991.7969 1005.4971 1013.6032 1116.2092 1124.1812 1135.4213 1241.9039 1250.5315 1297.6474 1332.6237 1351.8187 1360.7131 1379.1889 1465.7103 1483.1380 1494.5115 1548.6043 1557.8355 1569.3052 1590.1738 3122.2406 3164.9350 3184.1717 3217.7062 3248.6831 3591.8037 3613.1244
redmass: 6.9337 7.9621 7.1231 6.7157 7.4880 6.5118 9.5591 10.8063 5.6146 5.5207 6.6807 1.6064 2.9304 4.7857 5.4977 1.9568 1.5867 1.6911 2.4495 1.1076 8.4175 4.0402 4.0494 7.4911 5.4572 6.5906 5.8661 1.5403 1.4421 7.1799 7.4070 3.0827 1.3919 1.8871 1.9533 1.8350 2.0888 1.5629 1.5982 6.1506 2.4182 2.3102 2.2169 2.2316 2.7166 2.0031 3.5447 4.9672 5.7199 5.7236 1.0915 1.0902 1.0976 1.0631 1.0636 1.0826 1.0826
irintensity: 2.7636 1.8330 4.8340 4.3388 0.9523 1.0598 5.1718 2.4257 8.7103 50.3855 34.3339 58.0639 13.9499 17.7028 3.1351 80.3576 9.6100 99.3225 61.2411 265.0371 5.0527 4.2793 34.3198 6.8045 0.5697 0.7595 5.3026 34.2171 9.2982 93.2284 187.1474 40.5270 5.8618 35.5756 1.9024 51.3521 6.6221 30.6695 22.5838 7.0378 226.2883 122.3218 29.1657 0.4757 72.4035 88.7837 3.6171 133.7074 21.8946 65.6679 16.6201 0.0568 0.0847 39.0570 39.5845 88.2214 71.7529
temp: 298.150 k
press: 1.00000 atm
elementType: 8 8 8 8 7 7 7 6 6 6 6 6 6 6 1 1 1 1 1 1 1
symmnumber: 1
zpe: 380337.4 jmol-1
zpe.correction: 0.144863 hartree
zpe.thermalcorrener: 0.157946 hartree
zpe.thermalcorrenthalpy: 0.158890 hartree
zpe.thermalcorrgfe: 0.104398 hartree
zpe.sumelectzpe: -734.988945 hartree
zpe.sumelectthermal: -734.975862 hartree
zpe.sumelectthermalent: -734.974917 hartree
zpe.sumelectthermalfe: -735.029410 hartree
dipole: -1.3102 -2.1959 -0.7567
dipole: 2.6667
quadrupole: -99.4709 -78.4248 -82.0150
quadrupole: 1.9944 2.7385 -0.0178
quadrupole: -12.8340 8.2121 4.6219 1.9944 2.7385 -0.0178
hfenergy: -735.1338076 hartree
pointgroup: C01 [X(C7H7N3O4)]
dipole: 0.5196658 0.8681033 -0.2776245 debye
dipolederiv: -0.8058872 0.3012246 -0.0900731 0.0589709 -0.8028242 0.1333353 -0.0287611 0.1212341 -0.4103811 -0.754225 -0.3272512 -0.0537725 -0.0537031 -0.8138331 -0.0523501 -0.0309291 -0.0680638 -0.3848202 -0.9698782 -0.3028387 0.0321116 -0.0024027 -0.1615444 -0.0357534 -0.0465731 -0.0459966 -0.336891 -1.0521354 0.3475978 0.0039932 0.0023182 -0.1405743 0.0196284 -0.0418717 0.039439 -0.3329131 -0.556376 0.0327369 -0.0270267 -0.0471845 -0.3136345 -0.0175703 -0.0381035 -0.0166537 -0.2175273 0.3193086 0.0964381 0.0372893 -0.2571542 -0.6304772 0.0161763 0.0692168 -0.0367766 -0.3071966 0.4217535 -0.1626088 0.023149 0.0412236 -0.5970899 -0.0269121 0.0430263 -0.0331401 -0.3282137 -0.2453814 0.1282801 -0.0317503 -0.0634164 -0.1443019 -0.0083814 -0.0820759 -0.0079279 0.0473167 0.3745266 -0.0859732 0.0167803 -0.2631268 0.1456735 -0.0023318 -0.0078008 0.0079248 0.0664579 0.1777108 -0.1344585 0.0034949 0.0060013 0.0945516 0.0286421 0.0158317 -0.0000981 -0.0829315 -0.3369644 0.1613125 -0.000726 0.2769459 -0.0295758 0.0102538 -0.0031165 0.0123098 -0.0715581 0.0931006 -0.0492064 0.0306501 0.1162475 0.2608817 0.0592112 0.0859421 0.0469352 -0.0470154 1.0385887 -0.0817463 0.0442905 0.0487502 1.1018889 -0.2578412 0.029551 -0.2086042 0.2709535 0.6919012 0.1475689 0.0382137 0.2016831 1.0799515 0.1117474 0.0690746 0.1054063 0.1962888 0.096261 0.0661505 0.0039898 0.0467894 0.0611414 -0.0112796 0.0198529 0.004533 0.1482326 0.1071144 -0.0591547 -0.0069874 -0.0504981 0.0532698 -0.0134036 -0.008902 -0.0133484 0.1613471 0.011211 -0.0890931 -0.0163683 -0.1023002 -0.0259714 -0.0253525 -0.0359598 -0.0128197 0.1209508 0.1665246 0.0140236 -0.0170962 0.1203413 0.278207 0.0568457 -0.0247989 0.0785464 0.3594595 0.2748026 0.0090572 -0.0059373 -0.0943816 0.2941777 -0.0148622 -0.0185657 -0.0111928 0.3905507 0.4848447 -0.0258263 0.011904 0.025073 0.1637149 0.0596521 0.0288613 0.0668288 0.3701892 0.463199 0.0137672 0.0038715 -0.0101768 0.1263685 -0.0294541 0.0061014 -0.0285356 0.3877013 unknown
polarizability: 217.8231632|0.3774821|117.6574753|5.8395886|0.7426779|45.5443077 unknown
InChI: InChI=1S/C7H7N3O4/c11-6(9-13)4-1-2-5(8-3-4)7(12)10-14/h1-3,9-10,13-14H
charge 0 multiplicity 1
21 atoms
O  3.576427 -1.058491 0.44105
O  -3.61334 -1.165174 -0.325537
O  4.948719 1.131658 -0.065764
O  -4.887595 1.191991 -0.135746
N  -0.782063 1.097328 0.082817
N  3.516681 1.150575 -0.118771
N  -3.465795 1.111271 -0.065115
C  1.376449 -0.047009 0.059884
C  -1.391804 -0.121476 -0.07953
C  0.725504 -1.300009 -0.07851
C  -0.679344 -1.340707 -0.152475
C  0.572155 1.122028 0.1568
C  2.863949 -0.032678 0.141247
C  -2.883352 -0.12052 -0.167274
H  1.334607 -2.208052 -0.120256
H  -1.238616 -2.273351 -0.263648
H  1.016304 2.109753 0.330416
H  3.163729 2.012579 -0.52994
H  -2.983141 2.000724 0.066743
H  5.115556 0.169113 0.210222
H  -5.136432 0.217446 -0.255807
