program: Gaussian 09
title: 000016546
version: EM64L-G09RevD.01
frameworkgroup: C1[X(C8H8O2)]
method: RPBEPBE
basis: SDD
operation: Freq
keyword: #p
keyword: freq=noraman
keyword: PBEPBE/SDD
title: #p freq=noraman PBEPBE/SDD
converged: YES YES NO NO
title: Mulliken charges:
elementType: O O C C C C C C C C H H H H H H H H
charge: -0.273303 -0.287758 0.241359 0.087745 -0.305485 -0.268385 -0.161792 -0.161389 -0.221680 -0.509033 0.241922 0.235197 0.216400 0.213885 0.218695 0.283356 0.226658 0.223607
chargesum: 0.00000
title: Mulliken charges with hydrogens summed into heavy atoms:
elementType: O O C C C C C C C C
charge: -0.273303 -0.287758 0.241359 0.087745 -0.063563 -0.033188 0.054609 0.052496 -0.002985 0.224589
polarizability: 1.49911841e+02 4.98673878e+00 1.06069068e+02 -3.23441520e+00 2.46814020e+00 4.45016103e+01
1716.lowfreq: -13.8580 -6.1321 -0.0007 -0.0002 0.0007 4.9625 49.8605 75.4722 115.4274
frequency: 49.7664 75.4415 115.4082 181.3832 274.0300 327.7812 346.8615 357.5963 406.8718 421.9023 533.0743 597.3758 617.5459 706.9290 715.9239 763.2805 857.8674 865.5621 902.5789 930.2604 978.1093 993.9780 1011.2827 1039.2915 1102.8313 1140.9373 1190.3635 1217.5707 1265.7734 1278.0181 1374.7439 1395.5686 1418.4930 1450.8994 1456.0828 1469.7528 1497.4277 1543.1376 1586.9427 1611.5140 3002.4514 3098.8051 3107.8760 3111.5770 3123.5516 3129.2864 3144.6826 3152.1161
redmass: 2.6960 1.9398 2.0124 3.9324 3.3055 4.8766 4.2733 5.8561 3.9910 7.2527 5.1567 3.0603 5.8857 2.2769 4.4022 1.7232 1.8120 3.9884 6.2212 1.3998 3.2248 1.3500 1.3382 2.6460 1.2393 1.3754 2.4934 1.6159 1.5189 1.1874 1.7562 1.5296 1.2884 1.1116 2.3673 1.0795 3.4196 7.3138 4.8935 6.4492 1.0314 1.0836 1.0852 1.1015 1.0893 1.0921 1.0965 1.1051
irintensity: 7.4819 2.6271 4.0733 4.8980 8.5178 3.6813 2.1947 0.3333 8.3875 0.7767 7.8045 0.1473 12.2784 27.0865 18.9425 67.4389 4.0689 2.4272 7.2950 11.2300 14.0519 0.8935 1.3805 35.2152 5.5319 2.2001 149.9778 72.4851 38.6071 20.0390 6.8195 21.1667 114.5204 15.2478 35.9528 35.5680 161.8726 67.6564 10.2772 39.5862 67.8821 7.6633 2.8164 34.3695 6.6658 27.5534 23.7168 5.8880
temp: 298.150 k
press: 1.00000 atm
elementType: 8 8 6 6 6 6 6 6 6 6 1 1 1 1 1 1 1 1
symmnumber: 1
zpe: 364505.2 jmol-1
zpe.correction: 0.138833 hartree
zpe.thermalcorrener: 0.148078 hartree
zpe.thermalcorrenthalpy: 0.149022 hartree
zpe.thermalcorrgfe: 0.103868 hartree
zpe.sumelectzpe: -459.317876 hartree
zpe.sumelectthermal: -459.308631 hartree
zpe.sumelectthermalent: -459.307686 hartree
zpe.sumelectthermalfe: -459.352841 hartree
dipole: -1.9750 -1.8049 1.3769
dipole: 3.0090
quadrupole: -46.9320 -58.5742 -61.2803
quadrupole: -2.8168 2.5373 2.4190
quadrupole: 8.6635 -2.9787 -5.6848 -2.8168 2.5373 2.4190
hfenergy: -459.4567089 hartree
pointgroup: C01 [X(C8H8O2)]
dipole: 0.787437 -0.8415665 -0.2704813 debye
dipolederiv: -1.7882604 -0.1795267 -0.2620371 -0.2683699 -0.3209213 -0.04713 0.0144659 0.0162789 -0.3158109 -0.9018482 0.4314347 -0.0526539 0.425634 -0.752124 0.0186405 -0.0719498 0.031453 -0.3659218 1.5298739 0.2383738 0.204046 0.5584645 -0.197149 0.1426274 -0.0252604 0.0907838 0.0886989 0.687082 -0.5594532 -0.0474995 -0.6811381 0.5532908 -0.0301628 0.086656 0.0007558 0.1514433 -0.3947799 -0.1799389 -0.0487295 0.3507194 0.1699282 -0.0412978 -0.2395019 -0.0987759 -0.1547828 -0.2903774 0.3374714 -0.0284627 -0.1070035 0.118442 -0.0964209 0.0931636 -0.0745891 -0.1338181 0.2910544 0.2565692 0.002691 -0.0706693 0.2097438 -0.0999853 0.0777508 -0.1022402 -0.0627364 0.1489093 -0.0885607 -0.0158953 0.1177685 0.3616904 -0.1040996 -0.096187 -0.1507945 -0.0489868 -0.0473218 -0.1734492 0.0532059 -0.1261972 -0.4080126 0.0122096 0.064377 0.088591 -0.1729089 0.8075704 0.0530988 0.1599198 -0.1803364 0.1907167 -0.0550309 0.2361105 -0.0120223 0.3574508 0.0507282 -0.064817 0.0091063 -0.0658605 -0.0242825 0.0449161 -0.0055553 0.0331814 0.1411449 0.0626817 0.0199175 0.0016421 -0.0111144 -0.0500559 0.067483 0.0234359 0.0297168 0.1322684 0.0406992 0.0625456 -0.0313498 0.0822985 -0.0580814 0.0801207 -0.0280588 0.079914 0.1135672 -0.0649049 -0.0998122 0.0342194 -0.0997853 0.0180976 0.0460945 0.0278695 0.0417201 0.1215847 -0.1142631 0.0429036 -0.0301763 0.0341445 0.0710732 0.0351155 -0.024035 0.041505 0.1449897 0.1186437 0.0008397 -0.0019567 0.1499167 0.0163462 -0.0232042 -0.0363422 -0.0478232 0.0575364 -0.103962 -0.088868 -0.0222902 -0.1845805 0.0136696 0.0117083 -0.0229696 0.02838 0.0964418 -0.031525 -0.0087284 0.0762204 0.076109 0.087628 0.038416 -0.0739694 0.0039652 -0.1501605 unknown
polarizability: 148.6268846|-5.2349101|102.1189206|9.5689091|-16.6964049|49.7367138 unknown
InChI: InChI=1S/C8H8O2/c1-10-8-6-4-2-3-5-7(8)9/h2-6H,1H3
charge 0 multiplicity 1
18 atoms
O  -1.947559 -1.070417 -0.114607
O  -1.308821 1.697684 -0.31119
C  -0.640667 -0.608312 -0.073673
C  -0.34769 0.839113 -0.315501
C  0.254064 -1.609422 0.333607
C  1.016032 1.302921 -0.572864
C  1.672181 -1.597819 0.465102
C  2.260235 0.714797 -0.363002
C  2.578567 -0.584398 0.142724
C  -3.031761 -0.374742 -0.851243
H  -0.243676 -2.559232 0.570059
H  1.013736 2.345295 -0.921173
H  2.10364 -2.536797 0.836886
H  3.124672 1.351321 -0.59839
H  3.644017 -0.807465 0.279822
H  -3.238969 0.606852 -0.404558
H  -3.884537 -1.064973 -0.763607
H  -2.750064 -0.244506 -1.911093
