program: Gaussian 09
title: 000207582
version: EM64L-G09RevD.01
frameworkgroup: C1[X(C12H10O4)]
method: RPBEPBE
basis: SDD
operation: Freq
keyword: #pfreq=noraman
keyword: PBEPBE/SDD
title: #p freq=noraman PBEPBE/SDD
converged: NO YES NO NO
title: Mulliken charges:
elementType: O O O O C C C C C C C C C C C C H H H H H H H H H H
charge: -0.259556 -0.246487 -0.243361 -0.206724 0.288792 0.230351 0.255566 0.207160 -0.554166 0.392146 -0.533528 -0.319331 -0.314256 -0.485518 -0.803603 0.122356 0.265700 0.288752 0.234458 0.233308 0.236660 0.234540 0.253533 0.241760 0.240923 0.240524
chargesum: 0.00000
title: Mulliken charges with hydrogens summed into heavy atoms:
elementType: O O O O C C C C C C C C C C C C
charge: -0.259556 -0.246487 -0.243361 -0.206724 0.288792 0.230351 0.255566 0.207160 -0.288466 0.392146 -0.244776 0.148435 0.156944 -0.231985 -0.080396 0.122356
polarizability: 2.53195233e+02 -4.60325813e+00 1.42348988e+02 -3.94835826e-01 6.59122899e-01 6.95175411e+01
1716.lowfreq: -8.6482 -8.3242 0.0004 0.0007 0.0010 2.6690 63.8177 78.7372 124.0464
frequency: 63.7797 78.7266 124.0418 167.1113 181.3471 185.0011 206.8711 249.2195 285.2652 317.0285 333.8481 373.7720 392.3649 447.0111 462.3293 484.7518 496.5952 528.2235 541.4955 569.7861 652.6732 654.2787 691.5000 699.7609 723.2765 732.5510 766.2730 825.3429 862.9253 871.8504 871.9613 886.4296 888.7943 985.1055 1002.4798 1030.6575 1045.2591 1051.5766 1087.5247 1107.9475 1117.1286 1173.7522 1204.3061 1221.8663 1234.6549 1247.3005 1275.6801 1346.2860 1351.0417 1373.8318 1389.8657 1400.3994 1434.2110 1458.4104 1461.9115 1466.5960 1470.2066 1498.0249 1546.7895 1603.6836 1632.5054 1682.8810 2981.7900 3000.7969 3012.0422 3058.1684 3104.4206 3105.5765 3108.2295 3168.2437 3171.3225 3186.8305
redmass: 5.8274 3.9955 5.8296 1.6156 4.7424 4.6634 1.6905 4.6753 4.3322 2.8862 5.3529 6.3790 7.2786 3.1438 5.8469 5.0107 6.1148 5.9825 4.2486 3.9156 4.8895 4.8147 5.3475 3.8233 6.0549 3.6258 6.5216 5.1316 1.4739 1.7792 2.5141 2.6059 1.5480 2.5091 1.9044 3.3992 1.5744 3.7147 1.9561 3.7290 3.5983 2.9720 1.1860 2.0905 1.3164 1.2123 2.3867 1.6263 1.3444 2.5295 3.7916 1.3961 4.5401 1.1159 1.1695 1.0457 1.1052 4.4116 8.5407 7.4646 7.8996 10.2939 1.0381 1.0675 1.0617 1.0969 1.0985 1.0987 1.1044 1.0912 1.0920 1.0927
irintensity: 0.0245 7.1500 5.2017 0.1940 0.2508 0.5748 1.0936 4.2378 1.3802 10.6917 2.9239 4.1278 2.7107 5.2796 0.6989 8.4457 5.9788 9.3437 1.1887 3.9593 3.6661 2.1431 2.2885 15.0001 1.1512 1.1139 19.5725 29.1854 12.4773 7.1144 24.0559 76.8845 72.8330 1.4587 18.9896 80.3147 7.8134 38.7535 0.0317 55.1051 63.1319 73.1165 6.9849 9.0034 1.1355 3.0670 208.6748 130.5175 30.3634 82.8241 86.1980 35.0662 67.4776 5.1946 21.6203 16.9433 10.4652 68.6447 178.7124 21.4174 141.6967 547.3177 12.4941 59.1630 47.0137 12.8110 23.0339 31.5943 15.2595 1.7869 1.8342 0.8590
temp: 298.150 k
press: 1.00000 atm
elementType: 8 8 8 8 6 6 6 6 6 6 6 6 6 6 6 6 1 1 1 1 1 1 1 1 1 1
symmnumber: 1
zpe: 510898.1 jmol-1
zpe.correction: 0.194591 hartree
zpe.thermalcorrener: 0.207528 hartree
zpe.thermalcorrenthalpy: 0.208472 hartree
zpe.thermalcorrgfe: 0.155483 hartree
zpe.sumelectzpe: -763.019585 hartree
zpe.sumelectthermal: -763.006648 hartree
zpe.sumelectthermalent: -763.005704 hartree
zpe.sumelectthermalfe: -763.058692 hartree
dipole: -6.3928 4.5643 0.0662
dipole: 7.8552
quadrupole: -87.5243 -95.7296 -92.4022
quadrupole: 18.1727 0.8200 -0.9274
quadrupole: 4.3610 -3.8442 -0.5168 18.1727 0.8200 -0.9274
hfenergy: -763.2141757 hartree
pointgroup: C01 [X(C12H10O4)]
dipole: -2.5333164 1.7698863 0.0308752 debye
dipolederiv: -1.5855326 0.1330153 -0.0785862 0.3798463 -0.3741492 0.0475765 0.0145107 0.0030304 -0.2858783 -1.7506319 -0.2482429 0.0791609 -0.4946062 -0.4258656 0.0554093 -0.0391286 0.0073813 -0.2806819 -1.3691347 0.2238691 0.0104574 -0.1065225 -0.3692123 -0.0031416 -0.0015141 -0.0108926 -0.1945701 -1.343122 0.383669 0.0125412 0.7776003 -0.7525575 -0.0135819 0.0295733 -0.0142339 -0.3453469 -0.5697504 -0.1540738 0.0056466 -0.27238 -0.3063864 -0.0000109 -0.0092756 -0.0058221 -0.0343717 0.8813559 -0.3249955 0.0370996 -1.2799775 -0.0083667 -0.0491634 -0.0653128 -0.0401354 0.0281003 1.1368377 0.2885047 -0.0492904 1.1720343 0.3367135 -0.0518321 0.0594005 -0.0405226 0.0491277 0.7220284 -0.1891356 -0.0147691 -0.0784588 0.2844277 0.0018556 -0.0092378 0.0144347 0.1035827 0.1866267 0.1395153 -0.016991 -0.066931 0.0529981 0.0064373 -0.0465128 0.0162469 -0.1474775 0.9970597 0.0039076 -0.0089885 0.1711244 0.5635071 0.0127479 -0.0002349 0.0092506 0.0208333 -0.461102 -0.0035121 0.0199376 0.0252703 0.0144617 0.0075989 0.0529241 0.0187652 -0.1730464 0.7584181 0.0242912 0.1081386 0.4250147 0.1731645 0.0659672 0.158103 0.0585234 0.3295365 0.8724951 0.0254521 -0.1031321 -0.4309167 0.133937 0.057997 -0.1325564 0.0560176 0.3154206 -0.4839068 0.1540245 0.0066437 0.6807163 -0.544087 -0.0143563 0.0211449 -0.0098156 -0.1924267 0.0316236 0.0575911 0.0021854 -0.0474497 -0.2337156 -0.0065805 -0.0019243 -0.0061774 0.0464745 1.9741273 -0.4122211 -0.0152116 -0.861646 1.1008131 0.0278392 -0.0345045 0.0231928 0.2760721 0.118602 0.0000701 0.0018952 0.0217312 -0.0301231 -0.0006992 0.0024539 0.0022646 0.153696 0.1011678 0.0007236 -0.0003491 -0.0110754 0.0254864 -0.0004269 0.0017866 0.0009951 0.1851169 0.0155404 -0.0124726 0.0348221 -0.139425 0.0541 -0.0484428 -0.0945555 -0.0086976 -0.1437096 -0.1034586 0.0653692 0.0094193 0.1251464 0.0360936 -0.0216397 0.0341548 -0.0327764 0.0967288 -0.0080081 0.0072933 -0.024339 0.1509289 0.068424 -0.0463632 0.102994 -0.0040491 -0.1354581 -0.0997108 -0.0696927 -0.0144132 -0.118063 0.028518 -0.0261536 -0.0435691 -0.0372213 0.0940076 -0.013392 -0.0626221 -0.0010186 -0.0552609 0.0366895 -0.0031823 0.0003914 -0.0017591 0.1671214 0.0566773 0.0444481 0.1032743 0.0208188 0.0388963 -0.0331665 0.079668 -0.0690758 -0.0245493 0.0565463 0.0500418 -0.1006582 0.0253781 0.0323944 0.036741 -0.0785751 0.0723412 -0.0203767 -0.1213564 -0.1248176 -0.0034748 -0.0128973 0.0638388 -0.0014289 -0.0002036 -0.0012649 0.1120748 unknown
polarizability: 253.2746085|-3.4646423|142.2675294|-0.8815063|0.5885062|69.5196242 unknown
InChI: InChI=1S/C12H10O4/c1-7-4-12(13)16-9-6-11-10(5-8(7)9)14-2-3-15-11/h4-6H,2-3H2,1H3
charge 0 multiplicity 1
26 atoms
O  -2.893662 1.37266 0.022022
O  -2.858187 -1.556385 0.027322
O  1.929431 -1.520621 -0.044905
O  4.234268 -1.623606 -0.059763
C  0.769405 0.663248 0.019797
C  -1.68626 0.634765 0.019776
C  -1.674794 -0.796504 0.009648
C  0.750345 -0.766998 -0.01915
C  -0.479153 1.342963 0.032641
C  2.062451 1.33993 0.032747
C  -0.454573 -1.492053 -0.021614
C  -4.061844 0.560322 -0.385704
C  -4.064682 -0.767469 0.374641
C  3.218431 0.58076 0.008028
C  2.128948 2.850782 0.071469
C  3.23633 -0.876456 -0.029219
H  -0.523542 2.435611 0.043323
H  -0.443519 -2.58433 -0.03356
H  -4.020356 0.382904 -1.47797
H  -4.945238 1.169835 -0.138871
H  -4.075095 -0.590705 1.467022
H  -4.919075 -1.400922 0.088964
H  4.204676 1.052672 0.015362
H  1.622801 3.248911 0.970917
H  1.624901 3.294234 -0.807864
H  3.172996 3.20195 0.081043
