program: Gaussian 09
title: 000207577
version: EM64L-G09RevD.01
frameworkgroup: C1[X(C10H11N3O3)]
method: RPBEPBE
basis: SDD
operation: Freq
keyword: #p
keyword: freq=noraman
keyword: PBEPBE/SDD
title: #p freq=noraman PBEPBE/SDD
converged: YES YES NO NO
title: Mulliken charges:
elementType: O O O N N N C C C C C C C C C C H H H H H H H H H H H
charge: -0.224341 -0.216624 -0.258966 -0.073912 -0.398862 -0.041924 -0.376680 -0.468024 0.157175 0.263166 -0.359854 0.132519 -0.290637 -0.182740 -0.362273 -0.164674 0.251726 0.246773 0.261543 0.254436 0.359595 0.242183 0.234310 0.301982 0.241305 0.241485 0.231313
chargesum: 0.00000
title: Mulliken charges with hydrogens summed into heavy atoms:
elementType: O O O N N N C C C C C C C C C C
charge: -0.224341 -0.216624 -0.258966 -0.073912 -0.039267 -0.041924 0.121819 0.047954 0.157175 0.263166 0.116639 0.132519 0.011345 0.058565 -0.120788 0.066638
polarizability: 2.08070115e+02 -3.51349336e+00 1.29996365e+02 -5.20859698e+00 5.60126044e+00 7.39024863e+01
1716.lowfreq: -4.3886 -2.0997 0.0001 0.0006 0.0010 5.5144 23.0500 35.1865 43.1827
frequency: 22.8207 35.1709 43.1539 69.2501 105.0302 129.2283 164.7342 212.5327 217.9388 273.9170 321.6789 365.2002 381.3952 406.2221 439.6974 458.9793 499.1279 528.8588 575.2301 597.0716 620.0038 673.7010 682.7972 725.6194 753.4950 756.1078 772.8445 806.1627 833.6423 894.2952 914.4458 927.0666 955.9225 966.7513 990.7978 998.8298 1013.5238 1038.3454 1041.2071 1076.0421 1091.7973 1148.6831 1167.2041 1170.3351 1197.5782 1209.6744 1246.7157 1277.3725 1292.4548 1311.7687 1324.7941 1331.6773 1344.6426 1367.4133 1383.4855 1415.2268 1441.1535 1458.0214 1461.4552 1493.7037 1564.5841 1583.6721 1639.9299 1652.0481 2977.3002 3010.0249 3016.0754 3087.5140 3092.4972 3100.1449 3130.3195 3141.5530 3156.9198 3170.3409 3517.5007
redmass: 5.1811 5.7168 5.4786 5.2414 4.8573 4.6009 8.0265 2.2616 4.3826 4.4326 7.7145 9.7533 3.1134 3.5789 4.8074 4.7252 3.7639 3.4635 3.5692 5.5091 6.5961 2.8117 6.9135 5.2868 2.0575 2.0805 1.4673 2.4779 3.7969 6.1831 1.3072 2.6429 2.3567 2.2695 1.9688 1.9870 1.3584 2.9845 2.3761 2.6028 1.6040 3.6419 1.0892 1.1207 2.2663 1.3373 2.3932 1.8476 1.6728 1.8563 3.5381 2.2749 1.5014 1.7616 1.8953 2.0149 1.0864 1.0860 2.2601 1.0939 6.0267 5.5265 10.9466 5.4898 1.0692 1.0650 1.0558 1.0953 1.1095 1.0971 1.0874 1.0904 1.0958 1.1020 1.0768
irintensity: 2.6001 2.0914 4.1326 2.6595 4.2135 1.0147 4.9803 4.8872 2.6605 6.5815 8.9842 20.4384 8.9932 5.8454 18.4146 1.3674 9.2818 8.7454 4.1193 3.5068 0.5201 13.2661 15.7466 21.8150 94.3202 16.5379 86.5789 11.1687 8.9548 55.9905 0.5843 1.2060 2.9089 1.2183 2.2022 14.5593 0.5674 7.7640 8.6835 3.7264 10.5457 2.2568 0.9994 7.0126 277.2196 31.5692 2.2325 121.5302 1.5710 64.3276 7.2054 73.2099 9.4542 1.1748 98.3183 18.1230 15.3371 8.4407 34.0572 22.2622 10.5640 26.4456 186.4183 516.2581 41.1954 8.4486 21.3835 9.0128 13.1558 7.3000 6.1159 21.2031 2.2563 36.1099 52.4846
temp: 298.150 k
press: 1.00000 atm
elementType: 8 8 8 7 7 7 6 6 6 6 6 6 6 6 6 6 1 1 1 1 1 1 1 1 1 1 1
symmnumber: 1
zpe: 539901.1 jmol-1
zpe.correction: 0.205637 hartree
zpe.thermalcorrener: 0.219697 hartree
zpe.thermalcorrenthalpy: 0.220641 hartree
zpe.thermalcorrgfe: 0.162352 hartree
zpe.sumelectzpe: -776.386257 hartree
zpe.sumelectthermal: -776.372198 hartree
zpe.sumelectthermalent: -776.371254 hartree
zpe.sumelectthermalfe: -776.429543 hartree
dipole: -1.4138 -1.3664 0.3212
dipole: 1.9922
quadrupole: -98.2309 -89.5668 -92.7600
quadrupole: -13.3834 -0.5456 0.9957
quadrupole: -4.7116 3.9524 0.7592 -13.3834 -0.5456 0.9957
hfenergy: -776.5918943 hartree
pointgroup: C01 [X(C10H11N3O3)]
dipole: -0.5526784 -0.5542561 0.04125 debye
polarizability: 208.3533375|-2.4966747|127.7676279|-1.2050864|12.0733445|75.8480016 unknown
InChI: InChI=1S/C10H11N3O3/c14-9-4-6-13(10(15)12-9)16-7-8-3-1-2-5-11-8/h1-3,5,12H,4,6-7H2
charge 0 multiplicity 1
27 atoms
O  -0.138557 -0.735433 0.376992
O  5.235296 0.5531 0.059712
O  0.755828 1.84178 -0.050822
N  1.246098 -0.466444 0.04151
N  2.985139 1.134894 0.073362
N  -3.388148 -1.262762 -0.723511
C  2.178898 -1.487136 0.563248
C  3.56643 -1.259243 -0.066496
C  4.030431 0.192625 0.04061
C  1.580147 0.892813 0.03293
C  -0.980707 -0.838174 -0.87193
C  -2.369879 -0.377522 -0.495053
C  -2.571287 0.912762 0.058629
C  -3.886359 1.305882 0.385631
C  -4.655605 -0.859184 -0.411626
C  -4.951741 0.405737 0.144549
H  1.782685 -2.476486 0.28466
H  2.229684 -1.435567 1.670143
H  3.546037 -1.524422 -1.141151
H  4.323712 -1.896441 0.417708
H  3.247283 2.126499 0.070404
H  -1.006686 -1.885595 -1.218107
H  -0.529021 -0.182549 -1.636375
H  -1.706128 1.564026 0.220768
H  -4.078797 2.294378 0.816082
H  -5.4508 -1.586317 -0.612101
H  -5.986451 0.672979 0.382235
