program: Gaussian 09
title: 000207569
version: EM64L-G09RevD.01
frameworkgroup: C1[X(C11H10Cl2N2O3)]
method: RPBEPBE
basis: SDD
operation: Freq
keyword: #p
keyword: freq=noraman
keyword: PBEPBE/SDD
title: #p freq=noraman PBEPBE/SDD
converged: NO YES NO NO
title: Mulliken charges:
elementType: Cl Cl O O O N N C C C C C C C C C C C H H H H H H H H H H
charge: -0.015050 -0.004211 -0.219160 -0.213321 -0.258249 -0.076962 -0.399387 -0.379532 -0.468311 0.157196 0.268390 -0.427449 0.505540 -0.434146 -0.349795 -0.052505 -0.197616 -0.096122 0.250434 0.248042 0.261465 0.256116 0.217135 0.242976 0.360968 0.261910 0.300582 0.261061
chargesum: 0.00000
title: Mulliken charges with hydrogens summed into heavy atoms:
elementType: Cl Cl O O O N N C C C C C C C C C C C
charge: -0.015050 -0.004211 -0.219160 -0.213321 -0.258249 -0.076962 -0.038419 0.118943 0.049271 0.157196 0.268390 0.032662 0.505540 -0.172236 -0.049213 -0.052505 0.063446 -0.096122
polarizability: 2.62159087e+02 -2.55870080e+00 1.55474346e+02 6.32263970e+00 -1.87573362e+00 8.15518459e+01
1716.lowfreq: -9.8379 -2.1492 -0.0026 -0.0023 -0.0013 2.3138 19.1882 23.3068 32.1377
frequency: 19.1122 23.1945 32.1067 65.0954 83.1007 116.8438 131.1041 163.1187 177.6904 191.7084 203.8328 224.9792 285.5933 308.1866 347.0445 362.5613 385.5483 414.4124 434.7806 442.5823 451.1218 489.8922 526.2423 568.1668 575.2818 641.1919 670.3285 673.9988 685.1476 698.8907 740.4806 756.4516 807.0023 833.0723 859.0550 870.1663 900.0417 924.8627 974.0412 992.5308 998.5453 1006.7248 1035.3524 1073.4053 1117.7899 1148.6128 1149.9622 1178.5919 1197.9154 1208.6792 1221.4839 1258.6496 1276.1840 1310.6210 1330.9818 1341.4859 1367.4917 1374.1145 1382.8568 1389.9355 1439.1833 1461.7525 1469.1003 1493.8916 1572.0089 1598.6172 1640.4203 1653.0401 2978.4378 3004.2720 3010.2684 3079.1674 3087.2540 3100.0079 3150.2067 3153.6065 3172.7527 3517.9457
redmass: 7.3865 7.7712 8.5298 8.1668 6.1427 5.2638 6.2497 7.3474 9.8462 8.9497 2.8258 3.2562 6.0715 8.0743 7.8295 8.3633 5.9416 6.5955 4.6290 3.3089 3.8274 7.6219 3.6002 4.8178 3.9566 6.0978 5.4715 3.2240 6.4733 4.3442 3.9610 1.7293 2.3978 1.4697 2.7459 2.4501 2.9870 2.6356 1.4038 1.8803 2.0294 4.0752 3.1466 2.5174 2.1333 1.9347 2.2392 1.1227 2.3002 1.3483 1.8945 1.6410 1.8402 1.9138 2.2286 1.3753 1.7459 7.9797 1.8610 2.4636 1.0867 2.8564 1.1045 1.0931 7.9528 6.3601 10.0469 5.7478 1.0691 1.0588 1.0649 1.1070 1.0952 1.0971 1.0909 1.0925 1.0966 1.0768
irintensity: 2.1993 2.2435 0.8704 1.2238 2.8514 2.0485 0.4786 4.6397 0.3055 0.4421 4.2623 3.8127 8.4785 6.5215 8.8342 18.4834 3.9935 25.3889 11.1902 7.5523 5.1573 4.7752 6.2534 2.5887 6.8850 17.8733 2.1700 10.3827 23.0875 0.7201 40.6966 107.1453 22.7178 58.6253 21.3744 49.9232 26.6526 1.1029 1.0640 8.7935 16.0373 24.8665 8.3994 3.3906 39.3853 2.5336 3.1923 8.8229 311.5421 42.7843 14.5825 13.8841 121.1418 71.9323 70.1167 35.2617 0.8542 5.8018 91.9531 41.8529 15.0784 68.2991 5.7220 23.0309 11.0310 4.1178 188.2479 527.5971 39.9624 34.2223 9.8394 10.0981 12.5206 6.7733 5.0479 1.4736 2.9912 54.8945
temp: 298.150 k
press: 1.00000 atm
elementType: 17 17 8 8 8 7 7 6 6 6 6 6 6 6 6 6 6 6 1 1 1 1 1 1 1 1 1 1
symmnumber: 1
zpe: 520386.8 jmol-1
zpe.correction: 0.198205 hartree
zpe.thermalcorrener: 0.214949 hartree
zpe.thermalcorrenthalpy: 0.215893 hartree
zpe.thermalcorrgfe: 0.150523 hartree
zpe.sumelectzpe: -1679.124107 hartree
zpe.sumelectthermal: -1679.107362 hartree
zpe.sumelectthermalent: -1679.106418 hartree
zpe.sumelectthermalfe: -1679.171789 hartree
dipole: -2.0289 2.9471 -0.4025
dipole: 3.6005
quadrupole: -150.2518 -109.6216 -117.1485
quadrupole: -11.6508 -2.6592 -1.3800
quadrupole: -24.5778 16.0524 8.5254 -11.6508 -2.6592 -1.3800
hfenergy: -1679.3223116 hartree
pointgroup: C01 [X(C11H10Cl2N2O3)]
dipole: 0.7947672 1.0775441 0.4624339 debye
polarizability: 262.2501328|1.7398923|148.9617668|5.0240168|21.0932849|87.9733788 unknown
InChI: InChI=1S/C11H10Cl2N2O3/c12-8-2-1-7(5-9(8)13)6-18-15-4-3-10(16)14-11(15)17/h1-2,5,14H,3-4,6H2
charge 0 multiplicity 1
28 atoms
Cl -5.47634 1.632832 0.64698
Cl -5.8720 -1.307112 -0.779288
O  0.537217 0.668132 -0.265856
O  5.973161 -0.368775 -0.195742
O  1.564143 -1.877204 0.004094
N  1.94501 0.452266 0.027394
N  3.754399 -1.061294 -0.15619
C  2.805274 1.540182 -0.482373
C  4.227359 1.350938 0.078974
C  4.754947 -0.070416 -0.113297
C  2.343226 -0.889339 -0.055602
C  -0.287615 0.543437 0.994825
C  -1.666846 0.115389 0.557578
C  -2.786125 0.953855 0.760136
C  -1.840556 -1.150858 -0.059845
C  -4.070225 0.527791 0.35983
C  -3.122183 -1.570035 -0.464939
C  -4.239816 -0.731481 -0.251886
H  2.376501 2.495778 -0.14124
H  2.811075 1.542135 -1.591617
H  4.241918 1.567867 1.164396
H  4.932634 2.044585 -0.406138
H  -0.291165 1.518311 1.516562
H  0.189325 -0.223936 1.627811
H  4.062843 -2.037823 -0.21309
H  -2.671956 1.938441 1.225211
H  -0.964901 -1.787839 -0.224496
H  -3.268606 -2.543327 -0.942093
