program: Gaussian 09
title: 000207552
version: EM64L-G09RevD.01
frameworkgroup: C1[X(C20H21ClN2OS)]
method: RPBEPBE
basis: SDD
operation: Freq
keyword: #p
keyword: freq=noraman
keyword: PBEPBE/SDD
title: #p freq=noraman PBEPBE/SDD
converged: YES YES NO NO
title: Mulliken charges:
elementType: Cl S O N N C C C C C C C C C C C C C C C C C C C C H H H H H H H H H H H H H H H H H H H H H
charge: -0.069684 0.248669 -0.436573 -0.201997 -0.084234 -0.394565 -0.412835 -0.368385 -0.385000 0.375140 -0.333723 0.318464 -0.477028 -0.334863 -0.396829 0.524485 -0.365559 -0.408432 -0.230678 -0.370211 -0.245231 -0.236653 -0.222170 -0.117664 -0.242616 0.231082 0.240203 0.221392 0.214458 0.190622 0.208533 0.212765 0.186799 0.205652 0.191692 0.237548 0.205105 0.217456 0.269597 0.256181 0.262514 0.232782 0.234302 0.257136 0.333855 0.258497
chargesum: 0.00000
title: Mulliken charges with hydrogens summed into heavy atoms:
elementType: Cl S O N N C C C C C C C C C C C C C C C C C C C C
charge: -0.069684 0.248669 -0.102718 -0.201997 -0.084234 0.076720 0.023015 0.030770 0.014564 0.375140 0.063621 0.318464 -0.239480 0.087698 -0.396829 0.524485 -0.095962 -0.408432 0.025503 -0.107697 -0.012449 -0.002351 0.034967 -0.117664 0.015880
polarizability: 3.71136653e+02 -3.00458137e+01 2.87380059e+02 -2.12423777e+01 -3.16569692e+00 1.74930816e+02
1716.lowfreq: -10.6452 -3.9739 -1.8297 -0.0008 -0.0004 0.0017 19.7214 27.8726 44.5682
frequency: 19.4829 27.7941 44.5563 47.1112 66.9348 74.7312 86.7178 90.6379 108.7202 139.9794 159.7169 182.0393 196.8630 228.2949 241.0311 263.1234 269.6166 287.8065 300.2617 316.3600 322.0032 331.6484 349.9920 357.3608 367.6958 403.7398 406.8243 423.6896 447.8709 460.6741 477.1351 488.6792 531.2367 548.7172 558.7323 594.0452 605.9807 631.5180 658.9150 668.2316 700.5140 711.7563 743.5692 751.9063 774.0264 775.1949 803.3828 807.5367 812.0151 839.0579 853.6181 881.2076 885.5847 920.1958 942.9805 945.7843 962.3697 972.4792 993.6262 1002.0450 1018.5913 1026.2144 1035.6832 1042.5264 1051.2375 1056.8798 1061.9519 1080.6505 1092.9617 1118.4054 1124.6378 1128.1986 1137.4932 1140.6336 1163.1562 1170.8694 1197.4719 1218.6936 1225.8713 1234.9241 1250.1042 1251.2124 1269.6666 1277.5088 1294.8969 1302.4592 1327.5249 1339.4381 1345.8557 1359.3258 1362.2551 1365.4982 1372.4013 1378.7137 1383.9684 1389.6655 1398.2410 1418.3213 1452.7577 1454.0529 1457.8542 1460.7627 1462.8703 1468.1984 1471.1415 1482.5022 1544.1595 1562.5882 1584.4542 1595.0933 1608.2586 2850.2216 2858.2747 2890.3608 2917.7997 2939.1103 2984.6779 3003.9383 3033.8383 3048.9158 3051.2856 3084.1913 3085.0147 3123.0945 3129.0233 3140.8981 3150.7630 3152.6739 3154.3738 3167.3272 3178.1235 3563.6074
redmass: 5.8744 6.0321 6.4521 2.3546 3.6732 3.6381 4.2687 5.1487 4.5229 5.8535 5.7511 4.8966 4.2224 3.3963 6.0567 2.8186 5.9020 3.1512 4.0700 1.2972 2.6887 4.1306 6.4786 4.1208 4.4045 2.6841 3.5691 4.7864 3.9471 3.2823 3.0522 4.5747 6.0447 5.2063 4.2353 5.4804 2.9795 3.7193 4.0910 4.9203 5.9121 4.0736 4.1877 3.4247 1.4337 3.2312 1.3549 1.4883 1.3632 2.7320 1.8659 1.5682 1.4078 4.0691 2.6019 1.3575 1.4201 3.2973 1.3368 2.4929 5.0153 3.4431 3.8483 2.2830 1.9468 1.6878 2.6987 2.1035 2.0842 1.7963 1.8289 1.4925 2.1933 2.6123 2.6265 1.0620 1.1589 1.8217 1.8170 1.8973 1.4447 1.5648 1.3142 1.2580 1.4245 1.2641 1.8178 1.2851 1.3197 2.6981 1.4798 3.7667 1.7972 1.3794 3.7462 1.9769 1.3996 2.1787 2.6571 1.0809 1.1315 1.2449 1.5480 1.2541 1.1015 1.0888 6.7185 6.4081 7.8335 6.6317 7.0005 1.0711 1.0696 1.0677 1.0678 1.0699 1.0668 1.0897 1.0894 1.0915 1.0893 1.0928 1.0980 1.0862 1.0853 1.0893 1.0893 1.0946 1.0920 1.1007 1.0967 1.0663
irintensity: 0.6142 0.4939 0.7509 5.6214 1.5751 1.7438 0.7201 0.4868 2.0121 0.0408 2.8396 6.1782 2.1095 3.0353 4.0894 0.3222 0.9060 8.0854 1.4050 138.2979 11.9261 4.9993 9.7915 15.8677 11.9601 4.1584 8.1410 2.3743 0.6327 14.4185 8.0083 8.6638 5.0887 6.3514 4.8968 0.8074 1.2809 8.6994 11.8143 0.3634 23.0750 3.8368 1.7629 6.6218 59.6985 13.3280 15.0564 16.5320 47.2472 42.8251 13.7667 19.4518 7.6135 21.4978 22.6481 0.2550 15.4766 110.7282 1.4866 103.7063 27.9338 20.7548 7.4474 1.8373 5.6890 1.1487 13.1643 33.9186 0.3396 31.6776 48.9526 7.0342 1.1860 56.0132 14.1579 0.9172 25.5891 58.8293 55.5195 32.5503 18.5406 3.0081 19.3415 22.5373 15.3809 17.6650 0.4493 8.2647 12.0341 5.0505 38.6611 30.8996 16.0180 3.2179 18.7700 60.8133 6.0803 11.9307 72.7277 0.8738 11.6791 55.0666 4.9152 6.5661 0.9966 9.3022 25.0518 6.2047 101.6400 1.5721 200.9606 44.5929 78.3437 103.2583 54.6217 69.9810 58.1678 23.9558 46.1009 35.8863 30.2471 1.3805 51.4804 17.5516 0.4416 5.3284 2.3954 16.0665 1.7260 28.2419 2.5121 8.5754
temp: 298.150 k
press: 1.00000 atm
elementType: 17 16 8 7 7 6 6 6 6 6 6 6 6 6 6 6 6 6 6 6 6 6 6 6 6 1 1 1 1 1 1 1 1 1 1 1 1 1 1 1 1 1 1 1 1 1
symmnumber: 1
zpe: 959355.0 jmol-1
zpe.correction: 0.365399 hartree
zpe.thermalcorrener: 0.388259 hartree
zpe.thermalcorrenthalpy: 0.389203 hartree
zpe.thermalcorrgfe: 0.311619 hartree
zpe.sumelectzpe: -1815.719085 hartree
zpe.sumelectthermal: -1815.696225 hartree
zpe.sumelectthermalent: -1815.695281 hartree
zpe.sumelectthermalfe: -1815.772865 hartree
dipole: -2.4849 0.0127 1.2930
dipole: 2.8012
quadrupole: -179.4488 -147.1132 -165.1657
quadrupole: 21.4738 -7.1849 2.4746
quadrupole: -15.5396 16.7961 -1.2565 21.4738 -7.1849 2.4746
hfenergy: -1816.0844838 hartree
pointgroup: C01 [X(C20H21Cl1N2O1S1)]
dipole: -0.9877071 0.1004295 0.478441 debye
polarizability: 370.1608057|-34.4093129|286.0734551|-12.5078683|-18.9214847|177.2132666 unknown
InChI: InChI=1S/C20H21ClN2OS/c21-16-5-6-19-15(13-16)14-18(17-3-1-2-4-20(17)25-19)23-9-7-22(8-10-23)11-12-24/h1-6,13-14,24H,7-12H2
charge 0 multiplicity 1
46 atoms
Cl 5.557471 -3.254612 1.367881
S  2.356738 1.287618 -1.921012
O  -7.906827 -1.074974 -0.411908
N  -1.309459 -0.346844 0.053415
N  -4.116222 -1.070351 -0.072872
C  -2.26718 0.407748 -0.801275
C  -1.740182 -1.741857 0.272402
C  -3.687383 0.342273 -0.222258
C  -3.177194 -1.781004 0.826375
C  0.073334 -0.03754 -0.058588
C  -5.534159 -1.208647 0.337719
C  0.385964 1.415106 0.133098
C  1.025304 -1.039529 -0.149627
C  -6.502938 -0.999211 -0.845634
C  1.37412 2.124727 -0.600753
C  2.49151 -0.938262 -0.152433
C  -0.335176 2.134228 1.131263
C  3.229782 0.057222 -0.8625
C  1.616149 3.497183 -0.364015
C  3.241509 -1.952699 0.518825
C  -0.10106 3.502423 1.369495
C  0.872648 4.194994 0.611973
C  4.641905 0.063149 -0.863987
C  4.642927 -1.938013 0.488489
C  5.37145 -0.941402 -0.190434
H  -2.275591 -0.025227 -1.826119
H  -1.93999 1.456775 -0.875223
H  -1.066838 -2.213191 1.010306
H  -1.695105 -2.332914 -0.6712
H  -3.7107 0.877469 0.761917
H  -4.375513 0.865948 -0.908856
H  -3.493614 -2.836995 0.912661
H  -3.174336 -1.336163 1.854621
H  -5.814969 -0.50456 1.159013
H  -5.676113 -2.235498 0.731189
H  0.660993 -2.073329 -0.174517
H  -6.275882 -1.733292 -1.645319
H  -6.407607 0.014801 -1.266619
H  -1.079999 1.586843 1.718762
H  2.389661 4.007912 -0.94621
H  2.71157 -2.737027 1.068416
H  -0.669745 4.025168 2.146279
H  1.059715 5.260217 0.785358
H  5.174088 0.84905 -1.408897
H  -8.104283 -1.998288 -0.112836
H  6.464532 -0.949922 -0.20116
