program: Gaussian 09
title: 000207493
version: EM64L-G09RevD.01
frameworkgroup: C1[X(C22H29NO2)]
method: RPBEPBE
basis: SDD
operation: Freq
keyword: #p
keyword: freq=noraman
keyword: PBEPBE/SDD
title: #p freq=noraman PBEPBE/SDD
converged: YES YES NO NO
title: Mulliken charges:
elementType: O O N C C C C C C C C C C C C C C C C C C C C C C H H H H H H H H H H H H H H H H H H H H H H H H H H H H H
charge: -0.245210 -0.154344 -0.090408 0.215259 -0.541415 -0.513049 -0.406007 -0.049786 0.400323 -0.220125 -0.338725 -0.349938 0.158601 -0.716764 -0.707312 -0.420352 -0.325169 -0.318514 0.398991 -0.277269 -0.321986 -0.469930 -0.438195 -0.308722 -0.248529 0.224976 0.251998 0.234148 0.191313 0.207532 0.224006 0.207696 0.176485 0.198139 0.214170 0.209631 0.191267 0.206384 0.218268 0.212102 0.251883 0.206482 0.206759 0.256159 0.192281 0.216946 0.214002 0.191864 0.227137 0.219010 0.239838 0.238766 0.228662 0.230668
chargesum: 0.00000
title: Mulliken charges with hydrogens summed into heavy atoms:
elementType: O O N C C C C C C C C C C C C C C C C C C C C C C
charge: -0.245210 -0.154344 -0.090408 0.215259 -0.064440 -0.087588 0.025532 0.157911 0.400323 -0.043640 0.073585 0.050960 0.158601 -0.080010 -0.042188 -0.164193 0.084058 0.087353 0.398991 -0.050132 -0.102976 -0.230093 -0.199429 -0.080061 -0.017861
polarizability: 3.24980982e+02 1.20241415e+01 2.05096640e+02 1.72834347e+01 -2.43896777e+01 2.28819910e+02
1716.lowfreq: -9.0168 -6.8469 -0.0001 0.0002 0.0004 4.0839 17.6004 29.4913 34.6427
frequency: 16.7890 29.4646 34.4980 40.6572 44.3247 65.2556 85.1364 101.1991 111.4533 135.6613 160.7655 166.8309 175.8320 200.9655 213.5280 222.9992 239.8606 243.9035 247.5107 269.4692 277.3596 306.3554 316.7049 333.7826 368.8954 389.6255 408.7322 413.8370 419.8476 436.1177 440.3512 467.6201 472.5465 475.4048 507.0825 541.4022 555.0517 569.4242 606.9570 624.8204 676.9580 684.4435 744.9415 761.4484 782.0050 787.2817 788.7144 805.7469 807.4641 813.3870 822.9602 839.8665 855.0995 874.2057 889.0334 908.9376 911.5454 916.3246 934.6616 954.9897 958.1880 960.7436 979.6136 984.4028 991.9674 997.7291 1026.6973 1027.8469 1044.2424 1051.5673 1055.4625 1068.9917 1080.7239 1090.0983 1101.3719 1109.7767 1130.8990 1139.5769 1150.6910 1156.5515 1162.1138 1175.7004 1177.9282 1183.0872 1190.3147 1221.0730 1229.5911 1237.9620 1256.2491 1266.0303 1269.4777 1273.3175 1291.4720 1293.0627 1301.9432 1309.1836 1330.7511 1335.7938 1343.0080 1345.2051 1363.2563 1365.8471 1371.3283 1377.6847 1387.4289 1390.7027 1397.1667 1401.7671 1411.3436 1439.2110 1443.8456 1447.4692 1453.0783 1455.1410 1458.5832 1461.4107 1467.4862 1469.5436 1477.6348 1482.5856 1484.5466 1491.7801 1515.6693 1585.7379 1601.7256 1626.2389 1630.8399 2825.3706 2840.0028 2867.0342 2877.0353 2954.2572 2957.8750 2958.3245 2964.8906 2973.8804 2976.6531 3003.5272 3022.2307 3026.7315 3031.3305 3046.1923 3057.1249 3063.3370 3069.1423 3070.1249 3080.9269 3084.6873 3097.2864 3120.8880 3123.9362 3130.9678 3146.7897 3147.6521 3163.3979 3172.4263
redmass: 3.7071 3.4378 2.9449 4.7686 3.8492 4.2602 6.0056 4.8848 4.2917 3.9333 4.7556 3.9311 3.5184 2.1784 1.6514 1.7494 1.7858 1.4360 2.6621 2.7342 2.9800 2.9518 2.1395 2.7278 2.4919 2.1569 2.3501 2.9937 2.5841 4.9054 2.9672 2.9066 3.3422 3.9045 6.0008 4.1895 3.8227 3.5923 2.1721 3.3019 4.6986 2.8530 1.3012 3.2120 2.4669 2.6123 1.8565 3.6867 2.2789 2.4936 2.2259 1.6132 2.1717 1.7739 2.2606 1.5815 1.5692 1.5031 1.7665 1.6729 1.4173 2.1828 1.9042 1.4250 1.3698 2.8643 2.4169 2.4310 2.5503 2.2398 2.1732 3.2831 2.3278 2.9315 2.4815 2.5025 2.3161 2.2424 1.8785 2.3038 2.2846 1.5920 1.3062 1.3240 1.0643 1.2742 1.8352 1.7307 1.3521 1.6531 1.3617 1.3569 1.3017 1.3031 1.1771 1.3823 1.2788 1.4022 1.3757 1.2727 1.4035 2.3560 1.2654 1.2070 1.2117 1.3897 1.2279 2.5201 4.9241 2.4136 1.0824 1.0848 1.0982 1.6180 1.2487 1.1252 1.0703 1.0728 1.0737 1.0582 1.0994 1.0489 3.7418 7.3821 5.2003 8.7952 6.5729 1.0823 1.0725 1.0703 1.0691 1.0665 1.0633 1.0662 1.0366 1.0758 1.0442 1.0593 1.0880 1.0882 1.0948 1.0894 1.0995 1.0994 1.1014 1.1000 1.0962 1.0977 1.0973 1.0864 1.0863 1.0875 1.0943 1.0943 1.1002 1.0942
irintensity: 0.2198 0.0431 0.1079 0.0633 0.1601 0.1156 6.3271 2.2032 4.4862 0.5221 1.6098 1.0092 2.0769 0.4565 2.2987 2.9876 5.8233 0.8287 3.2851 5.8607 3.0488 1.8877 8.6287 5.9041 3.0700 0.0428 1.4182 1.3380 1.7488 1.8075 3.5343 0.8588 0.6019 0.5106 0.5544 5.7059 7.1215 2.2846 14.6065 1.8521 2.2201 2.1360 2.9595 10.8074 7.5172 10.1047 89.2205 9.4754 30.9969 6.5247 19.7002 0.4014 18.5684 3.3547 9.7282 2.8852 3.5858 7.9811 1.4888 2.5818 1.8913 7.2926 9.0998 4.4961 2.1785 28.3846 12.4001 11.8114 8.2790 10.8710 16.4475 5.0871 10.4626 27.6196 24.7849 6.8921 45.0091 30.9617 7.3713 5.1304 2.5935 5.2934 5.2010 0.7595 1.5374 7.4970 4.1067 2.7779 12.6933 3.5400 11.5453 3.8251 0.1702 2.9470 11.4007 7.5338 10.0075 0.7758 2.0654 18.2567 5.1279 9.3600 4.2593 14.9482 1.3621 8.7591 12.1223 5.3516 2.9087 6.3633 2.5059 2.1939 19.9074 1.7920 5.4432 5.6804 3.1286 4.6466 11.5544 7.2701 7.0092 25.6620 10.1388 9.1969 7.1821 97.4811 7.2328 61.3462 92.1515 52.6611 126.0888 34.7284 10.5428 114.9652 47.0460 7.9554 36.8790 8.9436 4.3659 60.7237 25.1161 32.0130 30.1773 43.7444 16.4789 82.1504 41.3616 37.0486 21.1101 2.7549 3.6395 3.3400 7.7395 72.1579 26.1460 12.7689
temp: 298.150 k
press: 1.00000 atm
elementType: 8 8 7 6 6 6 6 6 6 6 6 6 6 6 6 6 6 6 6 6 6 6 6 6 6 1 1 1 1 1 1 1 1 1 1 1 1 1 1 1 1 1 1 1 1 1 1 1 1 1 1 1 1 1
symmnumber: 1
zpe: 1207699.1 jmol-1
zpe.correction: 0.459988 hartree
zpe.thermalcorrener: 0.484333 hartree
zpe.thermalcorrenthalpy: 0.485277 hartree
zpe.thermalcorrgfe: 0.404840 hartree
zpe.sumelectzpe: -1059.012645 hartree
zpe.sumelectthermal: -1058.988301 hartree
zpe.sumelectthermalent: -1058.987356 hartree
zpe.sumelectthermalfe: -1059.067794 hartree
dipole: -1.5295 3.1056 1.0762
dipole: 3.6252
quadrupole: -156.2671 -153.6179 -147.3559
quadrupole: 7.0349 1.0840 -11.1246
quadrupole: -3.8535 -1.2043 5.0577 7.0349 1.0840 -11.1246
hfenergy: -1059.4726335 hartree
pointgroup: C01 [X(C22H29N1O2)]
dipole: 0.6467639 -1.1160698 0.608573 debye
polarizability: 323.9076761|13.3228172|214.185589|-20.6121364|26.0886941|220.8042678 unknown
InChI: InChI=1S/C22H29NO2/c1-18(2)16-22(17-24,10-11-23-12-14-25-15-13-23)21-9-5-7-19-6-3-4-8-20(19)21/h3-9,17-18H,10-16H2,1-2H3
charge 0 multiplicity 1
54 atoms
O  -6.482933 0.772132 -0.040777
O  0.032136 1.336448 -2.290427
N  -3.698112 -0.070045 0.016174
C  0.194842 -0.24615 -0.380184
C  -1.215546 0.16328 0.180527
C  0.399416 -1.803236 -0.294024
C  -2.398959 -0.56297 -0.495483
C  0.13048 -2.516281 1.062654
C  1.337809 0.549484 0.306641
C  0.1248 0.157539 -1.881749
C  -4.096806 1.248792 -0.546282
C  -4.800703 -1.050608 -0.165335
C  2.699356 0.489582 -0.200116
C  -0.050497 -4.034412 0.808401
C  1.253232 -2.288176 2.104063
C  1.086695 1.333175 1.440792
C  -5.386277 1.740655 0.130598
C  -6.07926 -0.530906 0.512326
C  3.754171 1.186584 0.517333
C  2.122825 2.029863 2.133598
C  3.077784 -0.211559 -1.397587
C  3.439152 1.947455 1.689683
C  5.105128 1.128053 0.037613
C  4.398757 -0.245149 -1.848152
C  5.430847 0.42289 -1.120344
H  -1.277345 -0.03879 1.264443
H  -1.320699 1.25469 0.03898
H  1.430726 -2.056223 -0.60389
H  -0.268061 -2.261478 -1.054679
H  -2.333736 -0.463431 -1.610377
H  -2.345665 -1.643992 -0.269088
H  -0.818923 -2.133715 1.489654
H  0.103011 -0.700043 -2.608065
H  -4.264795 1.178548 -1.650402
H  -3.292261 1.986145 -0.375075
H  -4.507087 -2.01225 0.296996
H  -5.013741 -1.236577 -1.248308
H  -0.899458 -4.236115 0.127497
H  -0.236833 -4.57497 1.754823
H  0.860399 -4.465635 0.349747
H  1.381303 -1.222262 2.352943
H  1.029308 -2.835146 3.039188
H  2.221527 -2.661652 1.718296
H  0.070602 1.419574 1.831937
H  -5.1978 1.904771 1.213554
H  -5.744904 2.675562 -0.330564
H  -6.930981 -1.20656 0.328233
H  -5.90527 -0.436401 1.606156
H  1.870088 2.623434 3.018835
H  2.318535 -0.719879 -1.999487
H  4.24592 2.469495 2.21756
H  5.881429 1.661244 0.599612
H  4.645569 -0.782474 -2.770348
H  6.465006 0.387495 -1.479414
