program: Gaussian 09
title: 000207480
version: EM64L-G09RevD.01
frameworkgroup: C1[X(C12H15N3O2S2)]
method: RPBEPBE
basis: SDD
operation: Freq
keyword: #p
keyword: freq=noraman
keyword: PBEPBE/SDD
title: #p freq=noraman PBEPBE/SDD
converged: YES YES NO NO
title: Mulliken charges:
elementType: S S O O N N N C C C C C C C C C C C C H H H H H H H H H H H H H H H
charge: 0.296103 0.404723 -0.214200 -0.217869 -0.127211 -0.028040 0.078091 -0.436155 -0.322427 -0.311213 0.349448 -0.678470 -0.673502 -0.686657 -0.211512 -0.061780 -0.275723 -0.227007 -0.093230 0.236485 0.227709 0.195471 0.221549 0.190150 0.206021 0.220762 0.210820 0.215580 0.227158 0.209534 0.213509 0.298762 0.266344 0.296775
chargesum: 0.00000
title: Mulliken charges with hydrogens summed into heavy atoms:
elementType: S S O O N N N C C C C C C C C C C C C
charge: 0.296103 0.404723 -0.214200 -0.217869 -0.127211 -0.028040 0.078091 0.028039 0.094592 0.084958 0.349448 -0.031307 -0.023301 -0.387895 -0.211512 -0.061780 -0.009379 0.069768 -0.093230
polarizability: 3.89047230e+02 -2.15202472e+01 1.97234605e+02 1.10370493e+01 -9.32215750e+00 1.11647810e+02
1716.lowfreq: -3.2677 0.0015 0.0017 0.0018 2.5520 6.7243 19.9421 32.6121 40.7970
frequency: 19.8393 32.5446 40.7847 51.4113 62.0682 67.9298 82.4666 92.8706 121.2128 156.8296 167.8105 191.5949 209.0079 218.8846 225.6113 260.9004 290.3930 291.9710 313.9149 337.3928 381.8672 427.5375 444.7180 446.8674 479.4890 503.7939 533.9147 586.2034 594.2682 631.3827 644.9932 658.9502 673.6432 692.3493 729.4015 751.0892 791.8449 796.0612 799.6379 807.4785 819.4588 829.8281 901.3414 934.7770 949.9307 994.4863 997.3238 1018.9840 1065.9142 1076.0689 1085.6448 1095.1225 1109.3371 1113.3738 1163.5414 1184.8084 1202.9330 1207.9808 1239.2134 1244.1428 1269.7597 1290.4894 1297.3568 1327.5928 1346.7317 1362.5885 1367.9727 1379.8232 1389.7867 1391.0792 1449.9639 1453.1425 1466.0789 1469.6105 1472.8393 1478.8898 1484.8765 1485.7336 1492.5336 1505.9971 1562.2254 2861.5763 2870.0406 2889.4650 2984.9233 2985.6319 3026.1453 3029.4470 3044.1155 3077.0484 3080.0044 3088.3680 3092.9819 3176.4662 3212.6941 3251.8166
redmass: 4.1346 5.2309 5.2045 4.6965 9.6913 3.0527 1.8946 10.3302 2.3122 7.7517 5.6123 1.8564 3.1306 2.0395 3.0176 3.4726 2.9114 3.0306 3.0535 2.8819 5.8780 4.7341 5.2258 4.3591 5.0329 4.3977 4.0497 5.6537 5.7109 7.0040 6.2944 9.7690 10.0470 6.3529 11.8138 2.6792 1.2089 1.5618 1.6928 1.5627 1.3189 5.9005 1.9978 1.4011 4.0368 2.1249 1.9344 2.1882 2.3946 1.8673 2.1753 2.6074 1.6798 1.8852 1.7751 4.2032 2.0808 2.1252 3.3673 1.7901 1.4545 1.2249 1.7121 4.6839 8.2435 1.4138 1.4505 1.5679 1.2305 1.2388 1.1919 7.1577 1.0520 1.0553 1.1088 1.1081 1.2023 3.0565 1.0810 4.1277 8.0188 1.0724 1.0715 1.0705 1.0359 1.0358 1.0863 1.0883 1.0879 1.0982 1.0979 1.1003 1.1003 1.0935 1.0986 1.0952
irintensity: 0.4921 0.8714 1.0036 0.0487 0.1700 0.1330 0.5988 0.4903 1.9432 6.3853 1.2960 0.1973 3.7707 0.0149 1.6646 1.5453 0.9684 2.2312 1.7106 3.6722 0.5752 11.1736 0.8470 2.8032 1.0860 6.3659 1.7287 7.3386 3.5324 4.9380 0.8377 1.0975 18.6940 1.4166 7.7987 8.8685 21.1748 5.4619 12.6157 10.2440 65.2862 49.0095 7.4276 2.0864 16.2621 18.7418 9.3443 8.9964 26.2183 28.0527 2.9072 43.2826 8.9916 20.1089 15.5757 176.4446 11.1989 49.9586 569.5235 11.8085 9.8358 21.5157 54.4114 87.1372 57.9286 25.5730 9.4223 4.3829 26.4547 21.2755 14.4485 71.9994 5.0282 3.5957 13.5600 6.9486 55.2376 139.4800 13.9216 39.9764 6.7331 39.7943 124.5126 77.2558 29.8843 29.2004 9.7988 20.2016 12.1509 46.6392 79.4684 54.3680 33.3590 1.9833 2.3813 9.2188
temp: 298.150 k
press: 1.00000 atm
elementType: 16 16 8 8 7 7 7 6 6 6 6 6 6 6 6 6 6 6 6 1 1 1 1 1 1 1 1 1 1 1 1 1 1 1
symmnumber: 1
zpe: 671469.5 jmol-1
zpe.correction: 0.255749 hartree
zpe.thermalcorrener: 0.275494 hartree
zpe.thermalcorrenthalpy: 0.276438 hartree
zpe.thermalcorrgfe: 0.204627 hartree
zpe.sumelectzpe: -1575.556566 hartree
zpe.sumelectthermal: -1575.536821 hartree
zpe.sumelectthermalent: -1575.535877 hartree
zpe.sumelectthermalfe: -1575.607688 hartree
dipole: -7.3531 3.2571 -0.3499
dipole: 8.0498
quadrupole: -150.2374 -125.6875 -126.7340
quadrupole: 20.1000 -4.7075 0.7470
quadrupole: -16.0177 8.5321 7.4856 20.1000 -4.7075 0.7470
hfenergy: -1575.8123155 hartree
pointgroup: C01 [X(C12H15N3O2S2)]
dipole: -2.3392378 0.5559114 2.0613111 debye
polarizability: 339.9102923|-69.6565212|131.7479822|-69.7557552|16.3872961|226.2713712 unknown
InChI: InChI=1S/C12H15N3O2S2/c1-3-14(4-2)7-9-8-18-12(13-9)10-5-6-11(19-10)15(16)17/h5-6,8H,3-4,7H2,1-2H3
charge 0 multiplicity 1
34 atoms
S  0.396377 -0.080476 2.124317
S  2.35493 -0.683078 -1.945517
O  6.146297 -1.875616 -2.387366
O  4.491131 -1.345666 -3.894494
N  -3.850909 0.866275 0.395976
N  -0.258411 0.127676 -0.461026
N  4.942983 -1.494721 -2.685276
C  -2.645876 0.925232 -0.464277
C  -4.366238 -0.529558 0.518028
C  -4.898029 1.84067 -0.020851
C  -1.394591 0.487836 0.267279
C  -5.243694 -0.747927 1.764055
C  -4.551073 3.295173 0.348392
C  -1.246269 0.440901 1.649608
C  0.773975 -0.196162 0.314794
C  2.071624 -0.6037 -0.158704
C  3.213275 -0.967333 0.573283
C  4.329482 -1.31486 -0.240514
C  4.040953 -1.216393 -1.600033
H  -2.496923 1.967113 -0.803568
H  -2.741004 0.309792 -1.391542
H  -4.927236 -0.831682 -0.401888
H  -3.488679 -1.199063 0.585396
H  -5.108444 1.765739 -1.117721
H  -5.833145 1.562343 0.496163
H  -4.681665 -0.48945 2.678825
H  -6.162552 -0.134666 1.745025
H  -5.553835 -1.807069 1.830409
H  -4.386135 3.383161 1.436261
H  -3.639428 3.652439 -0.164379
H  -5.377701 3.970681 0.06019
H  -2.002004 0.685682 2.391858
H  3.238692 -0.980591 1.665893
H  5.307027 -1.625102 0.131302
