program: Gaussian 09
title: 000207433
version: EM64L-G09RevD.01
frameworkgroup: C1[X(C12H14N2O3)]
method: RPBEPBE
basis: SDD
operation: Freq
keyword: #p
keyword: freq=noraman
keyword: PBEPBE/SDD
title: #p freq=noraman PBEPBE/SDD
converged: YES YES NO NO
title: Mulliken charges:
elementType: O O O N N C C C C C C C C C C C C H H H H H H H H H H H H H H
charge: -0.218816 -0.236060 -0.259526 -0.093355 -0.217667 -0.391279 -0.472947 0.194739 0.308845 -0.420321 -0.603328 0.458560 -0.350875 -0.428669 -0.218789 -0.220855 -0.231594 0.242302 0.247482 0.253218 0.255858 0.240557 0.206751 0.250547 0.266440 0.251648 0.271972 0.230111 0.228428 0.227211 0.229414
chargesum: 0.00000
title: Mulliken charges with hydrogens summed into heavy atoms:
elementType: O O O N N C C C C C C C C C C C C
charge: -0.218816 -0.236060 -0.259526 -0.093355 -0.217667 0.098505 0.036128 0.194739 0.308845 0.026987 0.165306 0.458560 -0.078903 -0.198559 0.009639 0.006355 -0.002180
polarizability: 2.22610846e+02 -3.11786101e+00 1.50573225e+02 6.44120185e+00 -8.82371840e+00 8.77596088e+01
1716.lowfreq: -3.7785 -0.0009 -0.0008 -0.0007 3.9841 8.0942 17.0987 30.3948 36.5147
frequency: 16.8478 30.3377 36.4817 79.3562 82.3268 92.2522 113.0596 131.2829 211.4055 222.0628 247.1946 294.4444 317.2863 353.0780 366.2675 377.6408 404.2591 448.3662 451.2212 492.2073 534.2422 578.4886 596.8929 616.7067 645.9059 693.7223 700.8005 703.2020 754.3878 812.1802 844.1249 857.6599 884.8990 907.5658 931.0080 950.0839 980.6360 984.8582 990.6072 997.9003 1000.6221 1026.6790 1063.1274 1088.2791 1109.7974 1125.0075 1129.8559 1172.1934 1173.4548 1175.1740 1188.0380 1208.1305 1230.6355 1236.2104 1278.9638 1322.2974 1325.9688 1336.6486 1347.6591 1377.1216 1387.4084 1424.9775 1440.4691 1441.1668 1473.4532 1474.1934 1479.9477 1486.0276 1494.2775 1595.2613 1599.0766 1616.5063 1633.6002 2971.6970 2999.2900 3007.6862 3015.6540 3073.8440 3084.1409 3098.5178 3109.2854 3119.5089 3128.0981 3139.9468 3140.5339 3151.3249 3165.2737
redmass: 4.9831 3.7455 7.1963 3.9753 1.1163 4.0000 4.6712 4.6556 2.6661 4.9506 3.7412 3.4437 3.7084 4.1519 3.8461 6.9781 2.8134 5.4960 6.3654 3.6194 3.6329 4.3395 4.5485 6.2718 5.4805 4.3139 8.5196 1.9176 1.7334 3.9093 3.0725 1.2534 4.1812 2.6827 1.5666 2.8468 1.4373 1.6762 5.7300 2.1613 1.3692 2.1872 2.0525 1.5238 2.9676 2.0704 1.6465 1.1413 2.3456 1.1248 1.1173 1.3519 2.4101 2.5013 1.8777 1.5666 1.2812 3.6134 1.3362 1.6315 8.3362 1.2457 1.0940 2.1915 1.1172 1.0441 1.0827 2.3929 1.0919 6.4026 9.4394 6.0781 9.5024 1.0694 1.0586 1.0650 1.0327 1.1068 1.0948 1.0968 1.1025 1.0866 1.0872 1.0919 1.1024 1.0967 1.1017
irintensity: 0.7756 0.5887 0.1231 1.7192 1.4088 4.1712 9.3555 0.5790 2.7634 4.2305 3.0100 4.9129 3.9071 21.3772 2.3913 24.7457 0.5838 10.9001 0.9223 14.1276 3.1039 1.4420 5.6592 0.4853 19.1171 0.1895 24.4643 43.1841 75.5035 4.8136 17.2091 0.7765 47.0185 13.0253 1.6860 10.5652 0.5432 1.0333 0.1695 45.6801 2.8946 7.9995 19.5189 7.4943 85.9614 95.2811 31.3522 4.7872 22.5521 2.5552 1.9321 7.3291 19.8313 86.7545 118.1081 14.1878 4.2368 106.3409 21.8152 53.9508 1.4288 113.2906 13.5385 11.0430 5.4641 16.7822 14.4789 9.3898 26.5182 52.2557 409.6399 1.6211 121.4406 44.6610 38.7594 11.2523 23.3996 10.2179 14.7582 7.7855 16.6940 5.8304 1.4180 17.9644 0.5663 28.2557 24.6997
temp: 298.150 k
press: 1.00000 atm
elementType: 8 8 8 7 7 6 6 6 6 6 6 6 6 6 6 6 6 1 1 1 1 1 1 1 1 1 1 1 1 1 1
symmnumber: 1
zpe: 642396.3 jmol-1
zpe.correction: 0.244676 hartree
zpe.thermalcorrener: 0.260570 hartree
zpe.thermalcorrenthalpy: 0.261514 hartree
zpe.thermalcorrgfe: 0.198726 hartree
zpe.sumelectzpe: -799.566775 hartree
zpe.sumelectthermal: -799.550880 hartree
zpe.sumelectthermalent: -799.549936 hartree
zpe.sumelectthermalfe: -799.612725 hartree
dipole: -1.7853 -2.4905 0.4155
dipole: 3.0923
quadrupole: -107.9697 -90.0988 -99.2953
quadrupole: 0.5799 0.0613 -3.0422
quadrupole: -8.8484 9.0225 -0.1741 0.5799 0.0613 -3.0422
hfenergy: -799.8114505 hartree
pointgroup: C01 [X(C12H14N2O3)]
dipole: 0.6930436 0.97836 0.2065373 debye
polarizability: 222.8091542|-2.5752964|149.870259|-4.6715932|10.8458202|88.2642663 unknown
InChI: InChI=1S/C12H14N2O3/c1-13-11(15)7-8-14(12(13)16)17-9-10-5-3-2-4-6-10/h2-6H,7-9H2,1H3
charge 0 multiplicity 1
31 atoms
O  0.325194 0.649025 -0.339734
O  -5.185739 0.249334 -0.108695
O  -0.944511 -1.715469 0.24703
N  -1.093467 0.616858 -0.004721
N  -3.067477 -0.73932 -0.004499
C  -1.837864 1.723563 -0.631418
C  -3.249292 1.744769 -0.023754
C  -3.932382 0.379672 -0.065339
C  -1.634819 -0.675241 0.072367
C  1.152679 0.55996 0.923636
C  -3.652946 -2.100549 0.057363
C  2.55902 0.246018 0.47959
C  2.841163 -1.022982 -0.090491
C  3.602364 1.192492 0.623501
C  4.151936 -1.337517 -0.507283
C  4.917505 0.874899 0.212816
C  5.193596 -0.390524 -0.353646
H  -1.876624 1.59693 -1.733209
H  -1.300607 2.660256 -0.412998
H  -3.897281 2.458259 -0.55751
H  -3.201541 2.064938 1.035051
H  0.72661 -0.254486 1.534425
H  1.082595 1.523223 1.462997
H  -3.283339 -2.710461 -0.782372
H  -4.745469 -1.988846 -0.000015
H  -3.364995 -2.594803 0.999232
H  2.02505 -1.745309 -0.207409
H  3.387222 2.177212 1.056681
H  4.364685 -2.317795 -0.948112
H  5.721082 1.610253 0.33137
H  6.212154 -0.637659 -0.673854
