program: Gaussian 09
title: 000207432
version: EM64L-G09RevD.01
frameworkgroup: C1[X(C11H12N2O3)]
method: RPBEPBE
basis: SDD
operation: Freq
keyword: #p
keyword: freq=noraman
keyword: PBEPBE/SDD
title: #p freq=noraman PBEPBE/SDD
converged: YES YES NO NO
title: Mulliken charges:
elementType: O O O N N C C C C C C C C C C C H H H H H H H H H H H H
charge: -0.217503 -0.218855 -0.253203 -0.075572 -0.398944 -0.378369 -0.467814 0.155715 0.261405 -0.421785 0.458472 -0.425362 -0.349721 -0.220697 -0.218499 -0.230985 0.249044 0.245317 0.259637 0.253330 0.207714 0.241729 0.358595 0.230089 0.269132 0.227776 0.229259 0.230094
chargesum: 0.00000
title: Mulliken charges with hydrogens summed into heavy atoms:
elementType: O O O N N C C C C C C C C C C C
charge: -0.217503 -0.218855 -0.253203 -0.075572 -0.040349 0.115992 0.045154 0.155715 0.261405 0.027658 0.458472 -0.195273 -0.080589 0.007079 0.010760 -0.000891
polarizability: 2.12447988e+02 2.12930464e+00 1.35772173e+02 -7.61082427e+00 -7.28545836e+00 7.89605545e+01
1716.lowfreq: -4.0361 -0.0007 -0.0003 -0.0003 0.7424 9.4967 13.6658 35.3669 37.2970
frequency: 12.4183 35.3647 37.2933 80.9131 94.2501 132.4250 162.6235 211.5650 228.5702 283.8902 330.8018 359.6921 362.8482 403.7295 436.4413 455.2886 494.5296 527.4955 575.0055 585.9932 616.6654 673.2917 681.8823 701.1188 726.6556 754.2479 760.6055 803.8588 831.2959 857.1186 881.7494 925.3677 931.9404 979.9985 982.7306 990.5481 997.8205 1000.7894 1026.2153 1032.7330 1072.5752 1088.2024 1149.9802 1172.7682 1175.7923 1186.8921 1195.9559 1208.5218 1229.8350 1277.3189 1311.1166 1325.0615 1331.1726 1349.3151 1367.2033 1382.9188 1387.5254 1440.1631 1441.7133 1474.5033 1485.6428 1494.5190 1595.8422 1616.1503 1640.5963 1652.5227 2975.3199 2999.7399 3009.4362 3072.4185 3085.9520 3099.5354 3119.5748 3128.2450 3139.6610 3151.0725 3165.4813 3517.7839
redmass: 5.4392 4.1956 6.8761 4.6673 4.9425 4.6596 7.8764 2.4180 4.5567 3.9114 5.2138 3.5196 9.4067 2.8102 5.4799 4.1712 3.7967 3.5334 3.5588 5.3105 6.3111 2.8659 6.9315 2.1209 3.1569 1.6662 1.9515 2.5961 3.8864 1.2505 4.1669 2.4202 1.6184 1.4749 1.5965 5.8889 1.9258 1.3834 2.1826 3.3716 2.4188 1.5156 3.5557 1.0718 1.0956 1.1329 2.1988 1.3362 2.4013 1.8547 1.8138 1.2792 2.4177 1.3379 1.7673 1.8106 8.3685 1.0879 2.1921 1.1099 2.4100 1.0922 6.1567 6.1062 11.3193 5.3916 1.0694 1.0579 1.0650 1.1079 1.0949 1.0970 1.0868 1.0871 1.0920 1.0967 1.1017 1.0768
irintensity: 1.3169 1.0963 0.3041 3.8425 1.3352 1.1540 5.3515 3.7465 5.3187 12.5716 2.4973 10.7977 13.4980 0.5803 16.3284 2.1156 12.3425 8.3742 4.3234 1.7900 0.3065 11.8760 18.1392 36.4054 49.6163 39.7420 132.3896 9.8790 28.6911 0.5394 46.7218 0.4735 2.0205 0.3481 0.5103 0.1128 13.0576 1.5940 7.3890 7.6274 2.1160 7.6535 3.2977 2.3449 11.4743 22.2168 270.6434 26.1320 9.3801 121.6522 61.9624 3.5943 78.4126 22.5310 1.7542 94.5304 1.3814 15.2400 10.9079 4.8679 7.2211 21.1215 1.4864 0.1846 203.4045 488.0655 41.6682 36.8311 10.4064 10.7710 12.7488 7.6091 6.1750 0.8951 16.4063 29.4358 23.9179 52.3896
temp: 298.150 k
press: 1.00000 atm
elementType: 8 8 8 7 7 6 6 6 6 6 6 6 6 6 6 6 1 1 1 1 1 1 1 1 1 1 1 1
symmnumber: 1
zpe: 571131.9 jmol-1
zpe.correction: 0.217533 hartree
zpe.thermalcorrener: 0.231729 hartree
zpe.thermalcorrenthalpy: 0.232673 hartree
zpe.thermalcorrgfe: 0.173585 hartree
zpe.sumelectzpe: -760.349169 hartree
zpe.sumelectthermal: -760.334972 hartree
zpe.sumelectthermalent: -760.334028 hartree
zpe.sumelectthermalfe: -760.393116 hartree
dipole: 2.0503 -3.3407 0.2738
dipole: 3.9292
quadrupole: -103.2867 -86.5617 -93.3117
quadrupole: 4.1607 0.0659 -2.8334
quadrupole: -8.9000 7.8250 1.0750 4.1607 0.0659 -2.8334
hfenergy: -760.5667013 hartree
pointgroup: C01 [X(C11H12N2O3)]
dipole: -0.7939562 1.3173103 0.1551994 debye
polarizability: 212.6340532|1.3618997|135.2710943|6.2221809|8.8545707|79.2755678 unknown
InChI: InChI=1S/C11H12N2O3/c14-10-6-7-13(11(15)12-10)16-8-9-4-2-1-3-5-9/h1-5,12H,6-8H2
charge 0 multiplicity 1
28 atoms
O  -0.090519 0.467319 -0.333509
O  5.398004 -0.235032 -0.037184
O  1.08108 -1.961704 0.328083
N  1.322416 0.364889 0.002612
N  3.221487 -1.044541 0.069749
C  2.132894 1.4160 -0.646404
C  3.549151 1.397623 -0.040595
C  4.161699 -0.002239 -0.018771
C  1.797762 -0.94603 0.127859
C  -0.921882 0.456431 0.932151
C  -2.34854 0.25307 0.489487
C  -3.306728 1.289241 0.606069
C  -2.737699 -0.999324 -0.053352
C  -4.64279 1.07723 0.19524
C  -4.06925 -1.20904 -0.470266
C  -5.025445 -0.172313 -0.344035
H  1.640095 2.383036 -0.457593
H  2.167017 1.256527 -1.743824
H  3.52282 1.766268 1.002988
H  4.225137 2.057129 -0.608183
H  -0.773728 1.416256 1.461512
H  -0.5612 -0.383774 1.550548
H  3.585201 -1.999199 0.161065
H  -3.008908 2.261383 1.018159
H  -1.988201 -1.793273 -0.149938
H  -5.380062 1.881823 0.292847
H  -4.364303 -2.177236 -0.889743
H  -6.060405 -0.337821 -0.664073
