program: Gaussian 09
title: 000207376
version: EM64L-G09RevD.01
frameworkgroup: C1[X(C10H9ClN2O)]
method: RPBEPBE
basis: SDD
operation: Freq
keyword: #p
keyword: freq=noraman
keyword: PBEPBE/SDD
title: #p freq=noraman PBEPBE/SDD
converged: YES YES NO NO
title: Mulliken charges:
elementType: Cl O N N C C C C C C C C C C H H H H H H H H H
charge: -0.043819 -0.259292 -0.367940 -0.111434 -0.432466 0.218081 0.489705 -0.312017 -0.330608 -0.201674 -0.310828 -0.210464 -0.236918 -0.244013 0.250791 0.249120 0.329357 0.283825 0.263752 0.256973 0.254335 0.232032 0.233501
chargesum: 0.00000
title: Mulliken charges with hydrogens summed into heavy atoms:
elementType: Cl O N N C C C C C C C C C C
charge: -0.043819 -0.259292 -0.038583 -0.111434 0.067445 0.218081 0.489705 -0.312017 -0.046783 0.062078 -0.053855 0.043871 -0.004886 -0.010512
polarizability: 1.49083184e+02 -6.00977405e+00 1.42330159e+02 -5.17776309e+00 2.16880944e+00 8.71559227e+01
1716.lowfreq: -13.4369 -0.0025 -0.0024 -0.0022 5.8962 10.8812 23.2696 37.4868 47.5454
frequency: 22.5996 37.2929 47.5119 126.3970 153.6675 172.1416 214.8959 265.3648 338.8347 370.1322 390.0981 443.5518 510.9647 539.4826 569.5025 623.6509 653.3362 667.7460 682.3864 711.1214 743.9810 749.8881 755.3892 765.8201 850.7985 851.9796 903.1943 931.4675 935.6062 958.2981 974.2748 984.8300 1019.1200 1042.3517 1087.4637 1097.6053 1133.4238 1155.1043 1176.3775 1203.2768 1229.8867 1269.5502 1275.7811 1341.1174 1355.9910 1378.0628 1391.0128 1427.9809 1457.5216 1467.4856 1469.9888 1526.4808 1575.8906 1602.2669 3023.5201 3089.1956 3139.4573 3153.5949 3164.6938 3176.4418 3232.0363 3260.4698 3582.7468
redmass: 5.3657 6.0512 5.3753 4.5387 8.5536 6.2847 6.3538 5.7302 3.1896 3.3906 10.3927 3.3485 6.8530 3.9156 5.5866 3.3038 5.6501 5.4634 1.1694 4.1131 2.2491 1.7429 1.2956 5.6207 1.3677 1.3735 6.8101 1.4188 4.6366 3.1649 1.3265 2.0974 7.6002 2.0940 1.6464 1.7957 1.5254 2.2326 1.0925 1.7285 1.9499 1.5929 1.4859 1.7673 2.0306 7.9798 3.3178 2.2762 4.0600 1.3164 1.8250 3.7657 6.1519 7.1882 1.0583 1.1063 1.0857 1.0901 1.0948 1.1006 1.0919 1.1089 1.0823
irintensity: 9.6189 5.8846 4.3371 3.4339 0.8281 8.9409 1.5686 1.9226 6.8411 0.7152 2.5395 6.0128 6.5677 0.0917 11.1074 2.2592 10.3961 38.9625 112.8312 0.8460 36.0711 63.1320 84.4944 0.8678 5.1036 10.7310 6.7653 5.8796 89.8887 28.2950 1.0544 5.3774 65.8991 28.9910 9.7746 33.4435 5.8284 4.7062 2.7826 56.3053 115.9862 33.7475 19.1696 2.7605 14.8988 10.7816 14.4298 19.3831 14.7510 71.7877 57.4053 6.0072 17.0543 34.2029 31.9216 6.0374 2.3633 8.5623 3.4252 14.1689 3.1422 3.2316 46.4103
temp: 298.150 k
press: 1.00000 atm
elementType: 17 8 7 7 6 6 6 6 6 6 6 6 6 6 1 1 1 1 1 1 1 1 1
symmnumber: 1
zpe: 451303.8 jmol-1
zpe.correction: 0.171893 hartree
zpe.thermalcorrener: 0.183854 hartree
zpe.thermalcorrenthalpy: 0.184798 hartree
zpe.thermalcorrgfe: 0.131166 hartree
zpe.sumelectzpe: -1030.230761 hartree
zpe.sumelectthermal: -1030.218800 hartree
zpe.sumelectthermalent: -1030.217855 hartree
zpe.sumelectthermalfe: -1030.271487 hartree
dipole: -1.4729 -0.3864 -1.5990
dipole: 2.2080
quadrupole: -85.6167 -83.0311 -85.4532
quadrupole: 11.6080 4.4633 0.1505
quadrupole: -0.9164 1.6693 -0.7529 11.6080 4.4633 0.1505
hfenergy: -1030.4026532 hartree
pointgroup: C01 [X(C10H9Cl1N2O1)]
dipole: 0.6469992 -0.4370509 0.3808178 debye
dipolederiv: -0.0915039 -0.0169616 -0.0015599 -0.032001 -0.3863656 -0.3541986 -0.004291 -0.330174 -0.4250582 -1.5571081 -0.1660717 0.2623981 -0.1976524 -0.2608432 0.0318877 0.6669447 0.1732075 -0.5763269 -0.134558 -0.0802468 0.0314748 -0.0758477 -0.4005817 -0.1527927 0.0277333 -0.2391116 -0.3121998 -0.3669802 -0.0109962 -0.0130131 0.0114182 -0.4080081 -0.0487313 0.0335894 -0.0452813 -0.2368862 1.1316466 0.1367421 0.074844 0.3809299 0.3489077 -0.1465615 0.1147643 -0.0622308 0.376398 -0.079476 -0.0976857 -0.0289316 -0.1178759 0.3188635 0.2034111 -0.0349024 0.1000406 -0.0271325 1.068315 0.1073982 -0.3601269 -0.1616251 -0.0593964 -0.1253931 -0.9274454 -0.2822585 0.2779382 -0.1875312 0.056736 0.0672906 -0.0079559 0.463562 0.6357438 0.0770777 0.5568504 0.5081411 -0.1783036 -0.044653 -0.0534999 0.2296364 -0.118803 -0.0215354 0.2497329 0.1377981 -0.1527519 -0.1927371 0.0818732 0.1031833 -0.0095994 0.0532452 0.0859059 -0.0262606 0.2035086 -0.0063861 -0.0867061 -0.0323573 0.1287979 0.1019042 0.032179 0.1306296 0.1482384 0.0637973 0.0626945 -0.0005129 0.0343319 -0.0442063 0.0347464 -0.0956957 -0.0536316 -0.0367543 -0.0242435 -0.1120883 0.044734 0.1265745 -0.010455 0.0414082 0.0187054 0.1222617 -0.114506 0.0811177 -0.0010452 -0.0748778 0.0166829 -0.0898931 0.0135879 -0.1462418 0.0330075 -0.0621506 0.0302572 -0.0850847 0.006915 0.0446569 -0.0032696 -0.0113572 -0.0804073 0.0474051 -0.0302531 -0.0766106 0.1104954 -0.0766842 -0.0176956 0.0271484 -0.0265627 0.1044532 -0.0748151 0.0140101 0.0192567 -0.0914787 0.3367495 0.0114163 -0.0819146 -0.0156085 0.1985307 -0.0247981 -0.0674425 -0.0166836 0.244711 0.094154 -0.0854927 0.0181071 -0.101593 0.087397 -0.0387876 0.0009551 -0.0362318 0.1000366 0.1416017 0.0672369 -0.074714 0.0919681 0.0308285 0.0225502 -0.0681871 0.000515 0.1433292 0.1093408 0.0024936 -0.0886673 -0.0172526 0.099593 -0.0647012 -0.1202816 -0.0446853 0.0399884 0.0218547 -0.0893209 0.003252 -0.0970682 0.0579206 -0.036736 -0.0011441 -0.0409592 0.1210493 0.0960823 -0.0264135 0.0154515 -0.0084972 0.0280562 -0.1252663 0.0377104 -0.1226942 0.0084779 -0.0244147 -0.0182475 0.1183039 -0.0251027 0.1141008 -0.0448539 0.1228625 -0.0451847 0.0331788 unknown
polarizability: 144.01359|11.0253888|114.663067|-0.3740677|29.2396697|119.8926088 unknown
InChI: InChI=1S/C10H9ClN2O/c11-8-3-1-2-4-9(8)14-7-10-12-5-6-13-10/h1-6,12H,7H2
charge 0 multiplicity 1
23 atoms
Cl -2.24833 -2.178383 -1.991735
O  -0.173443 -0.140347 -1.485128
N  2.502152 -0.672975 -0.090154
N  2.298116 1.459524 0.624832
C  0.946836 0.832145 -1.429895
C  1.895044 0.562179 -0.302676
C  -1.200348 -0.024432 -0.536058
C  -2.281098 -0.935857 -0.662781
C  -1.235654 0.932035 0.510585
C  3.328903 -0.556946 1.03047
C  3.197312 0.769834 1.452888
C  -3.378199 -0.898297 0.213766
C  -2.33856 0.971277 1.393409
C  -3.411048 0.064582 1.250401
H  0.578722 1.869764 -1.344359
H  1.424199 0.698907 -2.415383
H  2.318991 -1.522162 -0.624839
H  -0.400954 1.623815 0.656992
H  3.908297 -1.389344 1.419743
H  3.681514 1.261613 2.292703
H  -4.19645 -1.612949 0.083139
H  -2.349068 1.714339 2.197725
H  -4.264834 0.09658 1.934354
