program: Gaussian 09
title: 000207346
version: EM64L-G09RevD.01
frameworkgroup: C1[X(C15H14N2O2)]
method: RPBEPBE
basis: SDD
operation: Freq
keyword: #p
keyword: freq=noraman
keyword: PBEPBE/SDD
title: #p freq=noraman PBEPBE/SDD
converged: YES YES NO NO
title: Mulliken charges:
elementType: O O N N C C C C C C C C C C C C C C C H H H H H H H H H H H H H H
charge: -0.383013 -0.252894 -0.293796 -0.013328 0.271571 0.069354 -0.179007 0.382222 0.043823 0.389577 -0.565117 0.382445 -0.311158 -0.793708 -0.428735 -0.255343 -0.790457 -0.800168 0.063543 0.239389 0.237710 0.247015 0.242978 0.246203 0.232624 0.221156 0.212405 0.268054 0.241674 0.210340 0.242836 0.245013 0.376792
chargesum: 0.00000
title: Mulliken charges with hydrogens summed into heavy atoms:
elementType: O O N N C C C C C C C C C C C C C C C
charge: -0.006221 -0.252894 -0.293796 -0.013328 0.271571 0.069354 -0.179007 0.382222 0.043823 0.389577 -0.325728 0.382445 -0.073447 -0.057512 -0.196111 -0.034187 -0.068324 -0.101980 0.063543
polarizability: 2.96265734e+02 7.30449206e+00 2.15966253e+02 -3.93699622e+00 5.45379702e-01 8.86087963e+01
1716.lowfreq: -5.8227 -0.0005 -0.0004 -0.0003 2.8089 6.5473 41.8160 56.1156 69.9866
frequency: 41.8001 56.1082 69.9625 93.8625 94.0250 99.3727 127.5703 190.3451 194.9080 210.2974 243.1202 261.7270 287.2468 294.1953 299.3783 333.1619 347.3664 360.4339 408.5282 484.5506 507.1075 521.5863 533.3152 543.5578 554.6618 575.5883 603.4070 623.6651 629.2635 656.7220 677.0056 711.0534 756.1967 766.4619 776.7475 784.5392 849.8146 850.2389 886.3534 921.4487 956.9310 957.3508 988.6838 1004.9818 1034.3767 1037.8362 1045.8961 1047.7112 1049.6303 1081.2724 1090.7919 1118.3451 1183.4745 1201.9033 1223.1151 1246.8735 1276.8554 1291.1131 1327.5193 1364.5447 1386.9973 1400.1623 1403.0170 1406.1455 1412.3044 1425.0445 1451.9601 1456.2760 1467.6495 1469.9757 1473.1510 1485.4556 1491.8603 1514.8764 1532.1843 1597.4081 1603.0702 1615.6199 1630.5983 2983.0064 2984.8694 2995.3317 3061.0164 3064.6590 3079.6489 3092.5859 3097.4157 3110.1444 3126.9583 3150.4152 3166.0803 3192.0853 3505.0347
redmass: 9.6792 4.1936 3.2277 1.1352 1.2370 2.3642 5.2748 3.4516 3.0973 4.0349 4.0790 3.3244 1.3456 2.9118 3.5562 4.3885 5.5767 4.8803 4.2160 4.1105 4.6820 3.1325 2.7476 5.2533 3.9532 3.0235 2.5879 2.9452 4.5309 5.4396 5.4237 6.8730 1.4175 5.8704 7.8627 4.3910 3.2025 1.4714 1.3330 4.9426 2.1063 1.3495 2.0768 4.5938 1.5689 1.6141 2.8745 1.5523 1.5338 2.3277 1.9723 3.3221 1.2187 2.7946 2.2926 4.0351 1.8192 2.2342 4.0805 5.6193 3.1831 1.3849 1.2752 1.3117 2.2305 3.4878 1.1116 1.0452 1.1495 1.0455 1.2006 1.2644 3.0458 4.8043 6.4043 7.4965 6.7351 7.9662 7.6897 1.0385 1.0363 1.0365 1.0977 1.0967 1.0964 1.1005 1.1011 1.0976 1.0874 1.0937 1.0918 1.0943 1.0639
irintensity: 2.0915 0.2591 0.4732 2.7582 0.0813 4.8938 0.1298 0.0057 2.7548 2.0944 0.4649 0.5018 0.5203 2.1299 0.2991 2.0655 1.8829 1.5754 4.6316 10.4975 0.2415 12.8192 22.2050 11.5578 26.1528 9.8485 29.8277 39.0037 11.5072 14.9585 8.4164 13.5630 58.9889 5.1472 6.9089 6.6287 7.2325 14.7872 0.2844 0.3386 2.1021 0.6889 18.7037 129.8739 25.4050 14.6152 18.1067 8.2904 5.9805 21.3058 101.9298 23.2291 2.5073 49.7380 18.4668 34.9651 17.6672 45.8541 27.1098 70.6726 14.2697 34.8786 26.8596 11.4766 3.1809 51.6337 26.7245 13.4504 11.2997 19.5015 42.6359 17.0505 3.2962 28.9446 116.5057 27.2067 50.6820 179.4733 198.8852 12.3706 29.4380 19.4963 9.5695 14.1230 8.5772 24.9168 22.5528 16.8313 13.3253 25.6364 9.3762 14.6909 33.1284
temp: 298.150 k
press: 1.00000 atm
elementType: 8 8 7 7 6 6 6 6 6 6 6 6 6 6 6 6 6 6 6 1 1 1 1 1 1 1 1 1 1 1 1 1 1
symmnumber: 1
zpe: 673431.2 jmol-1
zpe.correction: 0.256496 hartree
zpe.thermalcorrener: 0.273464 hartree
zpe.thermalcorrenthalpy: 0.274409 hartree
zpe.thermalcorrgfe: 0.211899 hartree
zpe.sumelectzpe: -838.637612 hartree
zpe.sumelectthermal: -838.620644 hartree
zpe.sumelectthermalent: -838.619700 hartree
zpe.sumelectthermalfe: -838.682209 hartree
dipole: -0.7937 4.1373 0.8280
dipole: 4.2933
quadrupole: -105.4564 -92.6992 -116.0530
quadrupole: 3.9616 4.7118 -2.1245
quadrupole: -0.7202 12.0370 -11.3168 3.9616 4.7118 -2.1245
hfenergy: -838.8941083 hartree
pointgroup: C01 [X(C15H14N2O2)]
dipole: 0.2702377 1.6459863 -0.2660954 debye
polarizability: 296.5515072|-5.1111016|215.5236596|-4.8360076|4.064046|88.765617 unknown
InChI: InChI=1S/C15H14N2O2/c1-8-5-4-6-11-13(8)16-14-12(15(18)19)9(2)7-10(3)17(11)14/h4-7,18H,1-3H3
charge 0 multiplicity 1
33 atoms
O  -1.988955 -2.64509 -0.939338
O  -3.634323 -2.057497 0.57777
N  0.114861 1.001792 -0.021674
N  0.434182 -1.29936 -0.022655
C  1.516249 0.790613 -0.012296
C  -0.4944 -0.324172 -0.040603
C  1.671222 -0.639736 -0.008983
C  -0.651206 2.163952 0.011884
C  -1.930078 -0.414918 -0.03154
C  -2.706248 0.759657 0.041267
C  -2.036016 2.029357 0.046895
C  2.961093 -1.242928 0.006207
C  2.636953 1.655426 0.000425
C  0.031828 3.50651 0.011452
C  4.065175 -0.367258 0.018501
C  3.907838 1.049798 0.01546
C  -4.220942 0.746409 0.095364
C  3.096987 -2.748761 0.006698
C  -2.596933 -1.746509 -0.063268
H  -2.635619 2.942958 0.074963
H  2.555195 2.743408 -0.003118
H  0.681393 3.632424 0.897591
H  -0.723024 4.307733 0.025338
H  0.660476 3.642119 -0.888151
H  5.076798 -0.789643 0.029608
H  4.799967 1.685654 0.023942
H  -4.624272 1.763383 -0.044433
H  -4.572312 0.352878 1.065333
H  -4.65812 0.085397 -0.673218
H  4.156041 -3.057518 0.028114
H  2.579991 -3.189363 0.878574
H  2.616722 -3.18571 -0.887846
H  -2.462422 -3.519206 -0.871863
