program: Gaussian 09
title: 000207321
version: EM64L-G09RevD.01
frameworkgroup: C1[X(C14H22N2O2S)]
method: RPBEPBE
basis: SDD
operation: Freq
keyword: #p
keyword: freq=noraman
keyword: PBEPBE/SDD
title: #p freq=noraman PBEPBE/SDD
converged: YES YES NO NO
title: Mulliken charges:
elementType: S O O N N C C C C C C C C C C C C C C H H H H H H H H H H H H H H H H H H H H H H
charge: 0.236684 -0.288114 -0.350702 -0.075192 -0.604476 -0.389671 -0.473299 -0.388198 0.468748 -0.448460 -0.332136 -0.377064 0.088645 -0.238224 -0.349989 0.199555 -0.693885 -0.254818 -0.668399 0.215806 0.185480 0.231647 0.229101 0.192659 0.240209 0.165487 0.206791 0.210019 0.201109 0.191801 0.193941 0.212422 0.216251 0.208968 0.385706 0.311282 0.218066 0.234409 0.213831 0.251412 0.222599
chargesum: 0.00000
title: Mulliken charges with hydrogens summed into heavy atoms:
elementType: S O O N N C C C C C C C C C C C C C C
charge: 0.236684 -0.288114 -0.350702 -0.075192 0.092512 0.011615 -0.012551 0.044670 0.468748 -0.448460 0.040142 0.034064 0.088645 -0.238224 0.035753 0.199555 -0.056244 0.197658 0.019442
polarizability: 2.57053996e+02 -8.20193806e+00 2.08173465e+02 -8.72224499e+00 2.39310387e+00 1.19460895e+02
1716.lowfreq: -6.5323 -0.0019 -0.0012 -0.0006 4.5006 5.9129 26.4696 38.7408 51.5759
frequency: 26.4494 38.7093 51.5564 55.6241 64.5487 86.0626 96.8679 117.1108 122.4779 132.7897 161.0697 195.1692 203.5178 217.5387 232.3284 246.5873 256.1187 284.5777 300.6064 312.5679 338.2916 354.1416 378.2894 384.6624 393.0940 425.9915 447.4468 480.7151 507.1127 529.3487 563.4630 594.0766 622.4279 696.7861 713.1761 735.7617 738.6265 757.7528 784.6997 793.8323 804.5450 817.1865 852.6077 897.9950 931.8261 942.8508 967.3902 982.5250 997.3033 1012.1013 1036.6966 1058.2498 1072.7613 1078.7144 1095.6496 1103.5274 1125.3981 1129.2501 1153.3736 1164.0174 1177.8772 1188.8319 1219.3005 1224.2746 1256.2231 1260.7835 1279.0253 1280.7040 1289.1162 1293.2415 1308.7173 1329.6602 1335.8413 1345.8532 1363.1908 1370.1942 1388.2259 1389.4459 1393.1635 1400.0500 1447.4689 1457.1716 1458.8908 1462.3281 1467.4104 1469.3091 1474.5653 1477.1852 1481.4359 1484.8351 1485.5552 1489.7514 1575.3497 1600.4703 1623.2656 2786.8966 2815.7253 2844.5500 2963.5965 2973.0063 2975.6223 2990.4486 2998.6716 3002.6631 3004.0590 3008.2697 3029.5430 3033.6857 3044.5204 3062.9811 3070.4252 3072.3540 3084.2305 3091.4296 3116.8827 3324.3806 3648.0792
redmass: 4.1134 3.1776 2.4196 3.1914 2.2845 4.0311 3.1718 3.6809 2.9902 3.1763 4.3246 2.1983 2.0564 2.5880 1.1932 2.0808 2.3346 3.8007 3.4072 4.9683 3.2574 2.4905 1.2742 6.6341 4.4558 3.3701 3.4330 5.6298 4.3626 3.9422 3.8938 5.7819 6.2587 4.5295 2.3181 3.0442 1.1273 1.7255 2.8648 1.5630 1.4929 1.7078 2.8833 1.7346 1.3531 2.9351 2.6038 2.5463 1.9704 2.7859 2.7840 2.1701 2.8269 2.3110 2.1405 2.4925 2.0690 2.9618 1.6725 2.2498 2.5069 1.1952 1.2928 1.3708 1.3818 2.3810 1.2943 1.1203 1.1376 1.4421 1.4542 1.7196 1.7447 1.5473 1.7351 1.6529 1.3226 1.2362 1.3804 3.5919 1.1041 1.1512 1.0808 1.0504 1.0838 1.0741 1.0784 1.0425 1.0759 1.5459 1.3989 1.0906 10.1174 1.7081 6.4534 1.0718 1.0702 1.0708 1.0584 1.0394 1.0583 1.0362 1.0643 1.0864 1.0855 1.0962 1.0588 1.0878 1.1029 1.0977 1.1007 1.0994 1.0978 1.1030 1.1058 1.0594 1.0909
irintensity: 0.1994 0.0021 0.4521 1.3599 0.0325 0.8041 0.4758 0.4779 0.0058 1.0981 3.9003 0.7658 2.6678 1.3820 1.2666 2.9432 8.5469 1.6271 1.8008 1.5967 19.1812 5.2758 118.5073 1.7359 6.9106 2.6362 1.8315 6.1988 4.9401 20.4898 10.3929 10.5293 1.8300 5.4259 29.0596 8.8397 4.3964 106.6237 3.7913 11.0338 8.0116 2.1288 14.2187 10.1386 5.2418 36.8733 15.6761 2.4554 1.5955 67.3080 0.2457 18.5959 263.8614 6.1399 15.6040 2.4453 10.1059 60.7537 27.5427 51.8464 18.6835 6.6047 10.0120 0.1940 21.5854 122.0309 3.8766 9.0670 6.8317 16.1691 4.1430 11.4699 28.9844 2.1709 26.3052 20.7808 8.7539 28.2554 7.8829 28.1862 9.0049 62.2264 2.7560 16.5329 0.9112 1.3052 5.8360 12.9693 1.5560 108.8289 182.1601 16.3547 405.2157 191.4292 12.9464 75.7850 84.7644 154.8479 21.7721 31.3598 43.1698 25.7861 16.3603 33.2335 16.6641 7.4568 37.3385 47.1671 46.1694 17.1511 89.3551 56.5090 41.3379 4.7752 31.4355 149.7687 88.5932
temp: 298.150 k
press: 1.00000 atm
elementType: 16 8 8 7 7 6 6 6 6 6 6 6 6 6 6 6 6 6 6 1 1 1 1 1 1 1 1 1 1 1 1 1 1 1 1 1 1 1 1 1 1
symmnumber: 1
zpe: 898136.4 jmol-1
zpe.correction: 0.342082 hartree
zpe.thermalcorrener: 0.362868 hartree
zpe.thermalcorrenthalpy: 0.363812 hartree
zpe.thermalcorrgfe: 0.291487 hartree
zpe.sumelectzpe: -1203.225926 hartree
zpe.sumelectthermal: -1203.205141 hartree
zpe.sumelectthermalent: -1203.204197 hartree
zpe.sumelectthermalfe: -1203.276522 hartree
dipole: -0.4897 -0.2713 0.8880
dipole: 1.0497
quadrupole: -114.6897 -106.7317 -125.2100
quadrupole: -0.4564 -1.9993 0.2234
quadrupole: 0.8541 8.8121 -9.6662 -0.4564 -1.9993 0.2234
hfenergy: -1203.5680085 hartree
pointgroup: C01 [X(C14H22N2O2S1)]
dipole: -0.2009554 -0.1338815 0.3350388 debye
polarizability: 256.5472345|-9.333535|207.4304534|-7.8958827|11.5789616|120.7106681 unknown
InChI: InChI=1S/C14H22N2O2S/c1-3-5-7-16-8-6-10-11(9-16)19-13(15)12(10)14(17)18-4-2/h3-9,15H2,1-2H3
charge 0 multiplicity 1
41 atoms
S  0.300804 2.649427 0.535595
O  2.988138 -1.488018 -0.594028
O  4.283422 0.443879 -0.381097
N  -2.267133 -0.595499 -0.015465
N  3.056177 2.75444 0.194077
C  -1.313064 -1.625304 0.476443
C  0.099514 -1.41403 -0.105767
C  -1.903396 0.75932 0.479995
C  0.534098 0.028579 0.065002
C  -0.419986 0.975348 0.349365
C  -3.675256 -0.940484 0.301722
C  -4.708127 -0.029332 -0.392775
C  1.891195 0.570232 -0.032173
C  1.938453 1.967811 0.203106
C  -6.155775 -0.535798 -0.196747
C  3.134978 -0.119371 -0.33423
C  -7.205396 0.389839 -0.848606
C  4.24317 -2.240259 -0.89218
C  4.918901 -2.711346 0.399314
H  -1.694257 -2.61593 0.167389
H  -1.255026 -1.624468 1.596629
H  0.108693 -1.679394 -1.179812
H  0.817175 -2.090642 0.390188
H  -2.221909 0.896682 1.550695
H  -2.453997 1.513499 -0.113929
H  -3.861719 -0.925029 1.410115
H  -3.841058 -1.981818 -0.037513
H  -4.467179 0.01801 -1.473032
H  -4.639099 1.005138 -0.000573
H  -6.368734 -0.630645 0.888064
H  -6.246861 -1.556011 -0.622506
H  -7.028066 0.484806 -1.936397
H  -8.231021 0.002879 -0.705254
H  -7.16356 1.405942 -0.412633
H  3.936314 2.252466 -0.00881
H  3.021038 3.757031 0.356102
H  3.896459 -3.085647 -1.508732
H  4.914741 -1.589447 -1.478548
H  5.798594 -3.33643 0.156031
H  5.262622 -1.848871 0.994356
H  4.225235 -3.314751 1.010521
