program: Gaussian 09
title: 000016518
version: EM64L-G09RevD.01
frameworkgroup: C1[X(C14H18N2O2)]
method: RPBEPBE
basis: SDD
operation: Freq
keyword: #p
keyword: freq=noraman
keyword: PBEPBE/SDD
title: #p freq=noraman PBEPBE/SDD
converged: YES YES NO NO
title: Mulliken charges:
elementType: O O N N C C C C C C C C C C C C C C H H H H H H H H H H H H H H H H H H
charge: -0.222746 -0.259154 -0.078424 -0.079874 -0.531109 -0.347760 0.376543 -0.525853 0.087166 0.341085 -0.618453 -0.615446 -0.362873 -0.339726 -0.375724 -0.359160 0.320678 -0.537130 0.232854 0.248701 0.188239 0.244442 0.254048 0.225834 0.187916 0.224839 0.222487 0.188864 0.231962 0.219059 0.273456 0.240088 0.253220 0.222239 0.247558 0.222154
chargesum: 0.00000
title: Mulliken charges with hydrogens summed into heavy atoms:
elementType: O O N N C C C C C C C C C C C C C C
charge: -0.222746 -0.259154 -0.078424 -0.079874 -0.049554 0.084922 0.376543 -0.271805 0.087166 0.341085 0.020137 0.027867 -0.143815 -0.066270 -0.135636 -0.105941 0.320678 0.154821
polarizability: 2.98874655e+02 1.13557467e+01 1.58487284e+02 1.14429922e+01 -5.07629424e+00 9.94370269e+01
1716.lowfreq: -16.2976 -4.5375 -0.0008 0.0005 0.0009 3.3111 15.6167 21.1994 28.1791
frequency: 13.0069 19.9931 28.0213 52.8191 70.5723 90.2855 103.6358 115.8196 179.1370 189.4811 214.7209 220.7825 223.7757 239.2753 267.6099 290.8988 340.5703 341.4924 385.0870 411.9634 419.5367 437.7063 448.4203 489.4085 521.8934 584.9268 622.9237 631.7477 681.8053 714.9228 741.6164 772.8352 781.1583 810.0521 819.1549 839.1826 841.6681 853.0709 925.3858 936.0596 938.1837 985.9946 986.4234 1001.5826 1013.9053 1025.5164 1033.0991 1054.9191 1059.9294 1089.2617 1111.9444 1116.5821 1120.1066 1146.2135 1157.2990 1176.1393 1182.1820 1224.5029 1235.2719 1251.1596 1266.8912 1293.9439 1300.5627 1303.2757 1338.5306 1370.8756 1396.5711 1418.1251 1419.3242 1436.7051 1441.8288 1442.3942 1455.1898 1461.9415 1467.4919 1467.6241 1473.3550 1475.9812 1479.3534 1486.2198 1525.7057 1574.3413 1597.7896 1627.4471 2842.8011 2846.6098 2866.3228 2961.1737 3002.3037 3021.6383 3028.1457 3042.2840 3049.8015 3069.4697 3080.6406 3084.6242 3127.4913 3136.9168 3152.9400 3165.0569 3173.9395 3240.1844
redmass: 2.7605 4.6995 3.9037 4.8699 3.9898 2.2161 3.5100 3.9717 2.7044 3.4903 1.1270 1.6548 2.2130 1.3005 3.0732 3.2264 2.5956 4.4370 5.0122 2.9339 3.8836 2.5671 3.6807 3.8448 2.6999 5.6185 6.2678 7.0809 3.4159 4.3319 3.2645 5.9955 1.3442 1.3950 2.4285 2.1945 4.9477 1.6380 8.0104 5.9822 1.4026 8.5066 1.3551 2.8251 2.9660 1.7267 1.6394 2.4260 2.0554 1.2894 1.2602 1.4227 1.4472 1.8487 1.3246 2.1428 1.2596 2.1971 2.9408 1.9001 2.4427 1.4422 1.4147 1.2843 3.6396 1.3230 9.2698 1.4789 1.7005 2.4630 1.2126 1.4790 1.1087 1.0513 1.0597 1.0504 1.0831 1.0535 1.0831 1.0610 3.5648 7.4149 7.7071 6.2996 1.0675 1.0586 1.0590 1.0329 1.0598 1.0726 1.0718 1.0891 1.1040 1.1010 1.1006 1.1005 1.0993 1.0882 1.0885 1.0948 1.0975 1.0988
irintensity: 0.5203 0.2521 0.4906 1.0650 2.2709 0.8144 2.3327 5.2005 1.4202 2.0298 0.2580 0.9076 7.2426 2.1292 2.2453 3.0214 9.6843 1.7333 0.6349 0.2345 2.9774 1.7618 0.2874 4.4178 15.6205 25.7397 15.1752 1.6507 2.2716 8.0112 0.4255 0.5240 2.9250 18.0869 7.3255 74.6355 58.0542 21.4682 2.4380 6.4213 0.1916 54.8403 0.2695 6.2857 8.4909 2.8283 26.9470 59.7202 0.5521 6.5996 0.2106 10.9774 22.1914 4.4306 4.0141 1.5889 109.9388 28.3818 174.1377 1.6588 6.0126 2.5396 4.6674 11.2123 19.0099 12.4652 8.3334 46.4533 76.5334 53.2253 1.4737 53.6658 9.0446 18.9049 13.3918 12.6364 24.5340 14.6186 15.7843 20.3180 49.5146 71.9072 70.7116 113.7663 53.1715 77.6446 220.0172 74.5559 12.0932 43.5068 51.7367 2.2007 48.1003 16.0393 31.2654 58.0502 28.4136 11.8644 2.2115 14.7453 4.1007 0.8639
temp: 298.150 k
press: 1.00000 atm
elementType: 8 8 7 7 6 6 6 6 6 6 6 6 6 6 6 6 6 6 1 1 1 1 1 1 1 1 1 1 1 1 1 1 1 1 1 1
symmnumber: 1
zpe: 771570.1 jmol-1
zpe.correction: 0.293876 hartree
zpe.thermalcorrener: 0.312104 hartree
zpe.thermalcorrenthalpy: 0.313049 hartree
zpe.thermalcorrgfe: 0.244349 hartree
zpe.sumelectzpe: -802.820024 hartree
zpe.sumelectthermal: -802.801795 hartree
zpe.sumelectthermalent: -802.800851 hartree
zpe.sumelectthermalfe: -802.869550 hartree
dipole: 0.4233 5.2447 0.6256
dipole: 5.2988
quadrupole: -82.6029 -103.5415 -111.3118
quadrupole: 6.5550 -3.7350 -2.1141
quadrupole: 16.5492 -4.3894 -12.1598 6.5550 -3.7350 -2.1141
hfenergy: -803.1138993 hartree
pointgroup: C01 [X(C14H18N2O2)]
dipole: -0.164914 1.9618483 0.6855624 debye
polarizability: 298.7184689|-15.8275235|143.1423647|6.4211826|26.3306844|114.9381322 unknown
InChI: InChI=1S/C14H18N2O2/c1-16(2)9-8-13-10-14(15-18-13)11-4-6-12(17-3)7-5-11/h4-7,10H,8-9H2,1-3H3
charge 0 multiplicity 1
36 atoms
O  1.7501 -1.379415 -0.286818
O  -5.895212 0.350821 -0.385671
N  5.7326 0.425826 0.035914
N  0.316908 -1.492506 -0.5748
C  3.383425 0.076557 0.861737
C  4.317167 0.26832 -0.364913
C  1.967663 -0.214642 0.468485
C  0.755736 0.417086 0.672602
C  -0.24281 -0.399079 0.017277
C  -1.6976 -0.176813 -0.066273
C  6.017031 1.718956 0.690197
C  6.659997 0.164496 -1.085341
C  -2.30088 0.959319 0.52757
C  -2.534913 -1.106063 -0.751413
C  -3.693031 1.17886 0.449244
C  -3.918261 -0.90123 -0.837546
C  -4.50638 0.243987 -0.237902
C  -6.554791 1.515579 0.210784
H  3.380809 0.978251 1.49895
H  3.795039 -0.754356 1.46511
H  3.949785 1.133513 -0.975923
H  4.237551 -0.633198 -0.998433
H  0.597631 1.341335 1.221794
H  5.405745 1.835779 1.60154
H  5.822527 2.599942 0.025312
H  7.077755 1.749633 0.996067
H  7.701673 0.196101 -0.718368
H  6.567934 0.902454 -1.922514
H  6.47366 -0.843716 -1.495293
H  -1.684753 1.690939 1.061715
H  -2.079204 -1.987906 -1.212294
H  -4.124061 2.067118 0.9200
H  -4.567596 -1.609052 -1.361232
H  -6.417291 1.536573 1.30936
H  -7.621499 1.394302 -0.027227
H  -6.178652 2.459429 -0.229599
