program: Gaussian 09
title: 000207294
version: EM64L-G09RevD.01
frameworkgroup: C1[X(C7H12N2)]
method: RPBEPBE
basis: SDD
operation: Freq
keyword: #pfreq=noraman
keyword: PBEPBE/SDD
title: #p freq=noraman PBEPBE/SDD
converged: YES YES NO NO
title: Mulliken charges:
elementType: N N C C C C C C C H H H H H H H H H H H H
charge: -0.383838 -0.103994 -0.458767 0.110763 -0.356575 0.181602 -0.691575 -0.772673 -0.254101 0.210215 0.187558 0.196716 0.231757 0.211635 0.204995 0.218540 0.299497 0.244659 0.233151 0.235335 0.255100
chargesum: 0.00000
title: Mulliken charges with hydrogens summed into heavy atoms:
elementType: N N C C C C C C C
charge: -0.084341 -0.103994 -0.060994 0.110763 0.071898 0.181602 -0.056405 -0.059528 0.000999
polarizability: 1.06540954e+02 9.16666206e-02 9.20100195e+01 -5.46815109e+00 -2.68516844e-01 5.95913955e+01
1716.lowfreq: -9.8458 -7.3785 0.0008 0.0009 0.0009 11.2143 33.5291 85.9970 109.4755
frequency: 32.7021 85.8937 109.4574 121.3447 223.1252 227.5119 248.9818 310.2529 344.2169 419.4103 612.1423 633.2438 643.5475 681.0685 741.1958 761.0952 773.1680 858.0695 887.0925 918.4070 959.1299 1021.7446 1043.0780 1051.0818 1096.9070 1099.4215 1150.4587 1220.1368 1236.0503 1260.3454 1281.4194 1290.7420 1331.1271 1340.9091 1387.6039 1404.3297 1407.6988 1449.0304 1459.8004 1470.8284 1474.9681 1477.0804 1480.9650 1486.7005 1596.8050 2967.5300 2969.2596 2973.3902 2985.9643 3020.5968 3037.1341 3044.1614 3069.6238 3072.0975 3093.1845 3231.9065 3582.2314
redmass: 2.5324 1.8778 1.8171 1.4532 3.3412 1.1702 2.2073 2.7827 3.3581 3.1290 2.3110 3.6823 1.4418 4.2243 1.1484 2.7272 1.8035 1.3045 2.0064 4.9183 1.7663 1.6826 1.4343 2.8815 1.8771 1.7466 2.4135 1.7087 1.6312 2.0487 1.4945 1.2509 2.6001 1.5361 1.2184 1.3183 4.2562 2.2186 1.1065 1.0451 1.0554 1.0437 1.2193 1.0929 6.0759 1.0390 1.0374 1.0578 1.0625 1.0975 1.0987 1.1012 1.0994 1.1014 1.0952 1.0982 1.0817
irintensity: 2.6495 0.3507 2.8533 1.9938 0.1317 0.0326 0.2614 1.5295 14.2172 8.7885 67.1530 9.4426 39.7988 1.1326 4.4474 13.1650 17.0808 3.3321 10.3541 1.4196 0.3458 3.0775 2.6347 0.1108 3.4806 24.9662 10.5829 14.7679 7.1076 5.2683 3.2079 4.6962 14.2939 0.5342 11.7029 2.1587 21.8700 20.9099 0.7074 11.9153 1.7527 12.4115 1.5671 15.5052 19.1144 53.9687 29.7563 30.6417 47.3983 9.7891 25.4382 2.7738 61.3809 77.6071 15.5484 3.5403 28.3853
temp: 298.150 k
press: 1.00000 atm
elementType: 7 7 6 6 6 6 6 6 6 1 1 1 1 1 1 1 1 1 1 1 1
symmnumber: 1
zpe: 473466.2 jmol-1
zpe.correction: 0.180334 hartree
zpe.thermalcorrener: 0.190167 hartree
zpe.thermalcorrenthalpy: 0.191112 hartree
zpe.thermalcorrgfe: 0.144489 hartree
zpe.sumelectzpe: -382.748156 hartree
zpe.sumelectthermal: -382.738322 hartree
zpe.sumelectthermalent: -382.737378 hartree
zpe.sumelectthermalfe: -382.784001 hartree
dipole: 2.8296 2.6504 -0.7946
dipole: 3.9576
quadrupole: -42.8452 -56.3174 -57.0863
quadrupole: -0.1584 -2.5824 0.9750
quadrupole: 9.2378 -4.2344 -5.0033 -0.1584 -2.5824 0.9750
hfenergy: -382.9284898 hartree
pointgroup: C01 [X(C7H12N2)]
dipole: 1.0131936 1.1751307 -0.1299049 debye
dipolederiv: -0.5928568 -0.1561524 0.0304326 -0.1263486 -0.2244667 0.0390935 0.0769338 0.0413871 -0.2376117 -0.4962977 -0.1024634 0.0397365 -0.0268919 -0.361909 0.0042763 0.0489909 0.021991 -0.2623557 -0.0398976 0.0206129 -0.0189118 -0.0371437 0.1670685 -0.0101861 -0.0816311 -0.0266516 0.1167555 0.3777856 -0.0641741 -0.0962272 -0.0472708 -0.0198217 -0.008554 -0.1529773 0.0247811 -0.0885716 0.0624531 0.0077756 0.0146271 0.0362707 0.1286951 -0.0347942 0.096852 -0.0303261 0.0876887 0.2625798 0.168813 -0.0568233 -0.0625831 0.1048809 0.0420926 -0.0906991 -0.0351555 -0.0692458 -0.1031766 -0.0007424 0.0111758 -0.0160406 0.1074506 -0.0020935 -0.047714 -0.0098433 0.0676401 0.0276424 -0.034522 0.0285008 0.071049 0.0048974 -0.0325025 0.042165 -0.0005523 0.1417033 0.2275518 0.223184 -0.0707661 0.2432157 0.2194579 -0.0255939 -0.0544037 -0.0154936 -0.1087485 -0.0031234 -0.0377097 0.0558254 -0.0576827 0.0060573 0.1231711 0.0554521 0.0789321 -0.0713141 0.0351827 0.0173247 -0.0012837 0.0499534 -0.1477712 -0.111418 -0.0072559 -0.0628987 0.0381792 0.0171745 -0.0481815 0.0449483 -0.0303981 -0.0210942 0.1401083 0.0246502 0.1028217 -0.097596 0.051773 0.0522509 0.0188536 0.0336879 -0.0932579 -0.0921202 0.0190028 -0.0599031 0.0438914 0.0583431 -0.0087859 0.0261214 -0.0481239 -0.0226147 0.1318384 0.0892929 0.130527 -0.0651264 0.0496056 0.0213768 0.0180196 0.0940615 -0.1503856 -0.0903129 0.0573043 -0.0841442 0.0551825 -0.1025546 -0.0346611 -0.1173614 -0.043275 0.0860646 -0.0442439 -0.1580195 -0.0441436 -0.0655865 0.1643462 -0.0423119 0.0368715 -0.0479964 0.1675789 -0.0075829 0.0395508 -0.0119417 0.3320734 -0.0670756 0.1087361 0.0625502 0.0389315 0.0886609 -0.0053683 0.0520483 -0.0314152 0.0892674 -0.0165402 -0.0970442 -0.1267084 -0.044128 -0.0210531 -0.0379566 -0.1223999 -0.0966227 -0.0138544 0.0865466 -0.0544537 0.0510643 -0.0413991 -0.0609776 0.0537874 0.0615933 0.1387836 -0.0740209 0.0005383 0.0611281 0.0493548 0.062112 0.0425397 -0.0316406 0.051264 -0.0301321 0.1816503 unknown
polarizability: 106.3832321|2.260738|91.5692557|-5.2181608|4.3642096|60.1898816 unknown
InChI: InChI=1S/C7H12N2/c1-3-4-7-6(2)8-5-9-7/h5,8H,3-4H2,1-2H3
charge 0 multiplicity 1
21 atoms
N  2.293727 0.108043 -0.266649
N  0.641623 -1.411633 -0.0526
C  -1.320173 0.066544 0.581502
C  0.130139 -0.122333 0.223582
C  -2.283112 -0.249733 -0.594981
C  1.144577 0.838667 0.095363
C  -3.767377 -0.148415 -0.18504
C  1.158901 2.331243 0.263776
C  1.942345 -1.235661 -0.34296
H  -1.573141 -0.603677 1.427145
H  -1.494324 1.102721 0.932972
H  -2.073316 0.442888 -1.434275
H  -2.055831 -1.268244 -0.961696
H  -4.00192 -0.861561 0.627875
H  -4.015295 0.867493 0.178318
H  -4.436126 -0.374942 -1.035734
H  3.21732 0.504089 -0.437378
H  0.160467 2.680974 0.573422
H  1.879006 2.659076 1.038344
H  1.415416 2.856083 -0.676946
H  2.647191 -2.022821 -0.601141
