program: Gaussian 09
title: 000207288
version: EM64L-G09RevD.01
frameworkgroup: C1[X(C7H11NO)]
method: RPBEPBE
basis: SDD
operation: Freq
keyword: #p
keyword: freq=noraman
keyword: PBEPBE/SDD
title: #p freq=noraman PBEPBE/SDD
converged: NO YES NO NO
title: Mulliken charges:
elementType: O N C C C C C C C H H H H H H H H H H H
charge: -0.250855 -0.100789 -0.205595 0.316004 -0.686220 -0.686223 0.013288 -0.773490 -0.166175 0.222160 0.228808 0.217174 0.222062 0.222053 0.217173 0.228804 0.231944 0.231881 0.257673 0.260322
chargesum: 0.00000
title: Mulliken charges with hydrogens summed into heavy atoms:
elementType: O N C C C C C C C
charge: -0.250855 -0.100789 0.016566 0.316004 -0.018176 -0.018193 0.013288 -0.051991 0.094147
polarizability: 9.64917332e+01 2.12902382e+00 8.57170550e+01 -2.00967076e-03 -7.58396320e-03 6.08528575e+01
1716.lowfreq: -76.2075 -0.0007 -0.0004 0.0003 12.3622 13.3566 15.3644 43.7791 125.6366
frequency: -76.1559 43.4680 125.6344 158.5758 212.5712 242.7340 246.4944 269.0231 365.0120 397.1078 496.9696 597.9951 638.1364 683.3028 693.9940 762.7010 871.9297 889.4711 920.3808 925.8294 954.4336 989.1745 1001.5236 1046.9331 1086.8449 1111.8466 1159.8153 1212.3577 1232.5717 1290.9158 1310.3688 1346.0659 1375.9364 1395.5425 1401.7835 1443.4314 1465.2693 1470.7706 1471.4282 1473.7748 1478.1961 1489.8732 1610.8864 2981.5375 2983.7019 2984.8173 2998.5601 3060.7191 3078.3804 3083.1546 3087.3671 3093.2518 3107.6425 3271.8541
redmass: 1.0235 2.9362 3.7241 2.7394 1.0331 1.2919 3.8955 2.0053 2.4551 3.6799 3.1817 3.4126 3.7963 3.8045 5.7062 1.4418 3.1841 6.6529 1.1664 2.2303 1.4869 8.1266 1.9012 1.4529 1.8628 2.5074 2.0393 3.2928 1.3484 1.3265 1.7907 2.8378 1.1910 1.2125 1.3225 4.9691 1.0434 1.0504 1.0946 1.0446 1.0443 1.0649 8.8892 1.0347 1.0353 1.0386 1.0834 1.0984 1.1007 1.1000 1.1010 1.0999 1.0974 1.1002
irintensity: 0.0480 0.0007 0.0251 0.3293 0.0001 0.0437 4.3942 0.0537 1.6417 6.6906 5.1429 4.1027 10.0674 5.8279 0.0428 25.0123 1.3973 10.8757 3.7948 10.3570 0.0380 32.3949 9.5351 2.5464 41.4424 4.0194 1.3604 9.8407 1.2993 0.3148 1.6717 3.3070 16.9537 8.7164 27.1751 31.9200 4.1799 1.3935 8.3128 19.2132 15.2313 11.3320 13.3293 31.6774 29.9152 20.4798 15.2269 20.4892 12.8747 62.2688 11.2379 47.7698 9.4493 0.4604
temp: 298.150 k
press: 1.00000 atm
elementType: 8 7 6 6 6 6 6 6 6 1 1 1 1 1 1 1 1 1 1 1
symmnumber: 1
zpe: 437187.6 jmol-1
zpe.correction: 0.166516 hartree
zpe.thermalcorrener: 0.175574 hartree
zpe.thermalcorrenthalpy: 0.176518 hartree
zpe.thermalcorrgfe: 0.132270 hartree
zpe.sumelectzpe: -402.603172 hartree
zpe.sumelectthermal: -402.594115 hartree
zpe.sumelectthermalent: -402.593171 hartree
zpe.sumelectthermalfe: -402.637419 hartree
dipole: 2.0416 0.9584 0.0015
dipole: 2.2554
quadrupole: -59.1463 -49.5669 -55.3698
quadrupole: 1.5572 -0.0031 -0.0024
quadrupole: -4.4519 5.1274 -0.6755 1.5572 -0.0031 -0.0024
hfenergy: -402.7696884 hartree
pointgroup: C01 [X(C7H11N1O1)]
dipole: -0.8133697 -0.3546683 0.0005781 debye
dipolederiv: -0.6658816 0.1370057 0.0001175 0.1509096 -0.5683401 0.0000274 -0.0002585 0.0001324 -0.0930882 -0.3867626 0.0321096 -0.0000914 0.194257 -0.3722315 0.0001471 0.0001364 0.000067 -0.2324694 0.1326066 -0.0346441 -0.0000432 0.1028036 0.1339962 0.0000229 -0.0000049 -0.0000097 0.1449343 0.3704256 0.0624167 -0.0000258 -0.034018 0.1908929 -0.0002038 -0.0000525 0.0000616 -0.0977016 -0.0258791 0.0131027 -0.0315737 -0.0342723 0.0579694 0.0144616 0.0200573 0.0397046 -0.0296028 -0.0259337 0.0130771 0.0315728 -0.0342865 0.0579476 -0.014481 -0.0200475 -0.0397029 -0.0296425 -0.1034311 -0.1062011 -0.0001211 -0.0777893 0.4145713 -0.0001183 0.0002331 -0.0001215 -0.056851 0.0642965 0.0064243 0.0001098 0.0188137 -0.0901336 0.0000182 0.0000243 0.0001618 0.0985744 0.5435989 -0.0533938 0.0001692 -0.2694071 0.2175233 0.0001368 -0.0002677 -0.0005664 -0.054179 0.0394424 0.0417636 0.0000036 0.0209103 -0.1467606 0.000004 -0.0000046 -0.0000043 0.0370782 0.1002458 -0.0092106 -0.0152764 0.0330676 -0.1260605 0.0317389 -0.0060468 -0.0262147 0.077801 -0.1970976 -0.0790237 -0.0377109 -0.0805508 0.0623774 0.0086446 -0.0187766 0.0183783 0.0776835 0.0565917 0.0520538 0.1079117 0.0386272 0.0624378 -0.069098 0.0731821 -0.0482061 -0.1133319 0.0565788 0.0520591 -0.1079262 0.0386342 0.0624308 0.0690892 -0.0732019 0.0482039 -0.1133265 -0.1971026 -0.0790293 0.0377253 -0.0805481 0.0623774 -0.0086341 0.0188087 -0.0183665 0.0776889 0.1002473 -0.0092095 0.0152725 0.0330702 -0.1260656 -0.0317386 0.0060389 0.0262043 0.0777953 0.0735796 -0.0487137 0.0919576 0.0066584 -0.0086237 0.059277 0.0582648 0.1079674 -0.0470774 0.0730443 -0.049155 -0.0923446 0.0063669 -0.0086307 -0.0592381 -0.0586397 -0.1078766 -0.0465547 -0.0932786 0.0730115 0.0003067 -0.0156677 0.1016391 0.0000313 0.0003237 -0.0001137 0.1223485 0.0847095 -0.0144433 -0.0000335 -0.0175787 0.0226831 -0.0000867 0.0002314 0.0003013 0.1999212 unknown
polarizability: 96.6013253|1.8275427|85.6074629|0.0022189|0.0075254|60.8528575 unknown
InChI: InChI=1S/C7H11NO/c1-5(2)7-6(3)8-4-9-7/h4-5H,1-3H3
charge 0 multiplicity 1
20 atoms
O  0.113791 1.403188 -0.000204
N  2.142613 0.350077 -0.000436
C  -1.555463 -0.464424 0.000051
C  -0.125968 -0.001889 -0.000013
C  -2.304367 0.000668 -1.279548
C  -2.304247 0.000681 1.279717
C  1.109193 -0.634527 -0.000074
C  1.434209 -2.103413 -0.000019
C  1.521086 1.516001 0.000775
H  -1.520068 -1.57177 0.000063
H  -2.347351 1.103585 -1.320509
H  -3.33966 -0.386816 -1.278869
H  -1.798764 -0.357461 -2.194111
H  -1.798565 -0.357449 2.194235
H  -3.339544 -0.386792 1.279131
H  -2.347218 1.103599 1.320676
H  1.031939 -2.616575 0.892804
H  1.02929 -2.617192 -0.891276
H  2.528977 -2.227075 -0.001569
H  1.936215 2.518984 0.000971
