program: Gaussian 09
title: 000207280
version: EM64L-G09RevD.01
frameworkgroup: C1[X(C8H13NS)]
method: RPBEPBE
basis: SDD
operation: Freq
keyword: #p
keyword: freq=noraman
keyword: PBEPBE/SDD
title: #p freq=noraman PBEPBE/SDD
converged: YES YES NO NO
title: Mulliken charges:
elementType: S N C C C C C C C C H H H H H H H H H H H H H
charge: 0.221294 -0.006102 -0.017088 -0.486721 -0.247717 -0.694699 -0.706880 0.252902 -0.749789 -0.463914 0.208175 0.224099 0.207336 0.213708 0.197618 0.236045 0.214432 0.207143 0.220951 0.216222 0.244854 0.244064 0.264067
chargesum: 0.00000
title: Mulliken charges with hydrogens summed into heavy atoms:
elementType: S N C C C C C C C C
charge: 0.221294 -0.006102 0.191087 -0.055285 -0.247717 -0.047329 -0.064354 0.252902 -0.044649 -0.199847
polarizability: 1.27899332e+02 -1.81901968e+00 1.12933750e+02 -1.01551229e+01 -1.27242875e+00 7.47758630e+01
1716.lowfreq: -20.7080 -11.8303 -6.9478 -0.0008 0.0016 0.0023 20.5830 55.4494 84.9035
frequency: 15.6191 55.3422 84.7546 101.6523 173.1338 197.3197 226.6866 263.0823 290.9912 314.0335 361.4620 403.5029 409.3527 498.3951 537.8851 603.9767 636.6632 668.3226 752.1547 760.1751 809.9715 842.8594 905.3573 917.0796 938.9728 958.7018 989.0724 1042.8658 1121.2622 1130.7726 1151.9143 1176.1918 1219.5121 1235.6971 1277.4797 1297.7019 1324.4287 1331.0720 1378.2532 1395.9391 1398.9451 1446.4923 1451.9649 1457.8887 1466.2858 1468.9506 1472.3452 1481.3414 1485.3674 1558.6646 2967.6989 2969.1274 2970.1069 2974.6332 2991.4882 3032.1748 3059.2586 3067.3868 3071.6908 3072.9732 3078.7782 3106.1314 3221.3672
redmass: 3.0958 2.7668 1.2463 2.4899 4.1254 1.0726 1.1066 2.7745 3.2699 2.3733 2.4909 2.5682 2.2759 5.3744 6.0037 6.7922 5.8678 4.3260 4.9888 1.2731 2.7435 2.4702 1.7735 1.2205 1.8874 1.4686 1.7330 1.4846 1.9811 2.0551 2.7528 1.8670 1.3701 1.3322 1.3388 3.6992 1.3804 1.5387 1.2176 1.2171 1.2782 5.9472 1.1520 1.0460 1.0455 1.1017 1.0814 1.0504 1.0508 5.5998 1.0443 1.0694 1.0443 1.0574 1.0371 1.0995 1.0990 1.0985 1.0983 1.0993 1.0994 1.0982 1.0959
irintensity: 0.0314 0.0568 0.0875 0.1009 1.5070 0.0257 0.0425 0.7313 6.1219 0.9376 3.1550 2.1000 1.9752 3.3683 3.6931 12.3735 1.6142 3.0768 20.4463 34.2958 2.1318 9.8666 4.9424 6.1594 3.0964 0.0806 6.2041 5.3050 8.9986 8.2264 1.8774 16.6043 7.8166 1.1954 1.4785 0.9065 5.6077 0.7519 19.5624 17.0070 18.7274 48.2769 10.6525 10.2811 0.3765 8.5971 18.3700 11.6585 20.9469 10.5897 22.3420 14.7954 26.4625 39.2309 24.9116 14.5730 14.8608 67.2529 12.8599 41.1721 50.1954 21.0001 0.1082
temp: 298.150 k
press: 1.00000 atm
elementType: 16 7 6 6 6 6 6 6 6 6 1 1 1 1 1 1 1 1 1 1 1 1 1
symmnumber: 1
zpe: 502854.3 jmol-1
zpe.correction: 0.191527 hartree
zpe.thermalcorrener: 0.203202 hartree
zpe.thermalcorrenthalpy: 0.204146 hartree
zpe.thermalcorrgfe: 0.152474 hartree
zpe.sumelectzpe: -764.674588 hartree
zpe.sumelectthermal: -764.662913 hartree
zpe.sumelectthermalent: -764.661969 hartree
zpe.sumelectthermalfe: -764.713641 hartree
dipole: 2.0255 0.0566 -0.4049
dipole: 2.0663
quadrupole: -71.3798 -66.3330 -70.0073
quadrupole: 3.6969 -0.5864 -1.7239
quadrupole: -2.1398 2.9070 -0.7673 3.6969 -0.5864 -1.7239
hfenergy: -764.8661152 hartree
pointgroup: C01 [X(C8H13N1S1)]
dipole: 0.796727 0.1079267 -0.120303 debye
dipolederiv: -0.3397236 0.1771515 0.1392772 0.1513245 -0.3566481 -0.0568788 0.159057 -0.0605891 0.0600589 -0.3201599 0.053487 0.0264412 0.3874129 -0.6520671 -0.1274539 0.0756834 -0.039209 -0.1836544 0.194518 -0.0020366 0.0177192 -0.0587611 0.1193964 0.0092257 0.1151178 0.0211908 0.1314317 -0.0601217 -0.0080404 -0.0111046 0.0044844 0.0607605 0.0115503 -0.0539197 0.0175546 0.0939561 0.1775169 0.1586658 -0.0565566 0.1297748 0.2736431 0.0402926 -0.1720425 -0.0140823 -0.1857662 -0.0333613 0.0098109 0.0291041 0.021444 0.0863848 -0.0449281 0.0106463 -0.0573467 -0.082192 -0.096881 -0.0215055 0.0348092 0.0169558 0.1044988 -0.0019655 -0.0241598 0.0006671 0.0280993 -0.0885583 -0.023469 0.0072125 -0.0524211 0.3779756 0.0157445 0.0161374 0.0361771 -0.0205618 0.0605384 0.0916348 0.0148418 0.002951 -0.1026418 -0.0091892 0.011568 -0.0412344 0.0860537 0.4420792 -0.3104072 -0.2088803 -0.5511921 0.3135296 0.1638636 -0.2173473 0.1043639 -0.128377 0.0297835 -0.0588594 0.0042101 -0.0492136 -0.1604235 0.0110474 -0.0041326 -0.0047586 0.0221475 0.0005067 0.0049261 0.0491418 0.0170143 0.0542376 -0.0932726 0.0552642 -0.0467882 -0.1208971 0.0244309 -0.0440505 -0.0053645 -0.0416057 -0.1345652 0.0501923 -0.0028851 -0.0024403 0.086109 -0.0475198 0.0557856 -0.1505058 0.0752583 0.0538559 0.0633013 -0.1340837 0.0332189 -0.0424045 0.0884777 -0.0280695 0.0035861 -0.0426228 -0.1641604 -0.0139104 0.0181367 0.0600227 0.0586925 -0.1007826 -0.0244179 0.1226489 -0.02739 0.0625547 -0.0013872 0.1263973 -0.0001778 0.0515681 0.0768724 -0.0067825 0.0206987 0.0168772 0.0378938 -0.1079469 0.0799716 -0.1015087 -0.1409141 0.0664342 0.0154284 0.011047 -0.0792372 -0.1643964 0.0451672 0.0248798 0.0144758 0.0829769 -0.1112331 0.0451 -0.0870197 0.0685038 0.0630318 0.0553873 -0.13879 0.0636392 -0.0084555 -0.0906886 -0.1291489 0.0525666 -0.0480808 0.063104 0.0006836 0.0579587 0.0301464 0.0864708 0.0054222 0.0842643 -0.1002761 0.052277 0.0040047 0.0311286 -0.1010233 0.0757746 0.0286817 0.1105686 0.0139572 0.0436056 0.0159477 0.0155242 -0.037422 0.0487966 -0.0972665 -0.0807362 0.0118813 -0.0534242 0.0427977 -0.0097013 0.0445071 -0.0032298 0.0487693 0.0081704 0.1777126 unknown
polarizability: 128.6819858|0.6989717|112.5877332|-8.2773969|3.1961018|74.3392255 unknown
InChI: InChI=1S/C8H13NS/c1-6(2)4-8-7(3)9-5-10-8/h5-6H,4H2,1-3H3
charge 0 multiplicity 1
23 atoms
S  -0.8532 -1.872541 -0.419421
N  -2.592175 0.050723 0.171746
C  2.184246 -0.326302 0.158865
C  1.106842 0.192138 -0.846717
C  -0.314856 -0.133704 -0.473362
C  2.012166 0.319486 1.551602
C  3.599122 -0.068764 -0.408048
C  -1.374837 0.7035 -0.131307
C  -1.353134 2.209011 -0.049994
C  -2.498047 -1.258552 0.073023
H  2.043941 -1.422673 0.263581
H  1.336424 -0.220317 -1.849961
H  1.207684 1.291851 -0.930278
H  2.748037 -0.088027 2.268885
H  2.166595 1.414878 1.494382
H  1.00046 0.138001 1.956689
H  3.740004 -0.561943 -1.388316
H  3.776301 1.01574 -0.544845
H  4.376112 -0.450772 0.279154
H  -0.369482 2.624931 -0.320441
H  -2.113721 2.639757 -0.725613
H  -1.601345 2.540944 0.974395
H  -3.308037 -1.962666 0.261279
