program: Gaussian 09
title: 000207230
version: EM64L-G09RevD.01
frameworkgroup: C1[X(C17H23ClN2O2)]
method: RPBEPBE
basis: SDD
operation: Freq
keyword: #p
keyword: freq=noraman
keyword: PBEPBE/SDD
title: #p freq=noraman PBEPBE/SDD
converged: YES YES NO NO
title: Mulliken charges:
elementType: Cl O O N N C C C C C C C C C C C C C C C C C H H H H H H H H H H H H H H H H H H H H H H H
charge: -0.066836 -0.319510 -0.263398 -0.063114 -0.472047 -0.103571 -0.106463 -0.505716 -0.485553 -0.414375 -0.416283 0.030317 -0.445029 -0.646471 0.253673 0.420446 0.370242 -0.305411 -0.400718 -0.821173 -0.246796 -0.228348 0.211547 0.211208 0.213476 0.222537 0.215411 0.238795 0.210250 0.191426 0.196675 0.208603 0.252576 0.213649 0.213148 0.194590 0.225776 0.223735 0.329824 0.236097 0.290576 0.227365 0.218076 0.257045 0.233751
chargesum: 0.00000
title: Mulliken charges with hydrogens summed into heavy atoms:
elementType: Cl O O N N C C C C C C C C C C C C C C C C C
charge: -0.066836 -0.319510 -0.263398 -0.063114 -0.142223 0.107976 0.104745 -0.069702 -0.031348 -0.012700 -0.011005 0.282893 -0.018232 -0.002369 0.253673 0.420446 0.370242 -0.305411 -0.164621 -0.085157 0.010249 0.005403
polarizability: 2.72378037e+02 -5.96957336e+00 2.15276104e+02 1.60632865e+01 1.83150776e-01 1.47651635e+02
1716.lowfreq: -18.6573 -4.9393 -0.0015 -0.0007 0.0012 4.7672 16.3212 22.6609 37.0596
frequency: 7.1638 22.5762 37.0508 66.0726 74.5703 90.7731 124.7644 139.4978 145.9199 175.9768 191.2518 197.8928 218.2879 223.7761 261.6834 270.3818 284.4721 292.5519 308.2120 314.3650 358.4614 381.9849 384.8614 423.0345 425.2335 438.7408 442.8222 474.2581 509.1149 525.1674 542.4733 562.5137 608.2928 643.2660 654.5644 674.1266 695.0110 714.8811 733.4546 751.2834 772.5910 794.0541 811.3987 815.0298 833.4813 839.0919 862.1399 891.3930 894.4815 911.5909 932.9655 962.0788 969.2582 972.7870 984.6043 995.7440 1008.0141 1014.3720 1051.7248 1084.2086 1085.2214 1092.3345 1103.2773 1104.3775 1123.5147 1131.8206 1138.7165 1141.1611 1165.8959 1185.0769 1188.8830 1203.7977 1237.5476 1244.8628 1252.3950 1261.4705 1269.2825 1282.5725 1284.3104 1308.5404 1319.3589 1324.3145 1342.9365 1346.6101 1349.1798 1357.6855 1359.5090 1365.2334 1369.7860 1398.0773 1416.4623 1430.7834 1447.2870 1453.9894 1454.1465 1458.8881 1462.2141 1467.1414 1480.1441 1481.1278 1489.8905 1494.2336 1499.0871 1572.4803 1609.0546 1660.4168 2875.7604 2978.0815 2979.9339 2983.1182 2987.0258 2987.7979 2997.2473 3001.4028 3008.8958 3010.5575 3028.9734 3041.7408 3043.3179 3053.7576 3057.8220 3067.6463 3067.8053 3075.8223 3091.2063 3134.1700 3155.9079 3178.2737 3514.8822
redmass: 4.2324 5.6416 4.9204 4.9170 5.3175 8.1800 3.2869 2.7627 5.1521 2.4700 1.0623 1.6862 5.0519 2.3232 2.4300 4.3807 2.3781 3.7012 3.7658 4.2165 3.2178 2.5784 3.7913 3.8375 3.0816 2.2590 4.6221 4.4624 3.9306 4.0940 3.6047 2.2727 1.4759 5.1218 4.9966 4.9733 4.9430 5.0508 4.2670 3.0883 1.2803 2.5704 3.7032 3.6398 1.5120 2.9003 4.2612 1.5641 1.3444 4.7282 2.1920 2.0770 1.3371 1.8509 8.1831 1.6289 3.7750 1.8492 1.5384 1.3753 1.7883 1.7080 1.7136 1.6248 1.1147 1.8191 3.1207 2.4997 2.3487 1.5088 1.5369 1.9671 2.1388 1.3546 1.7730 1.3366 1.5668 1.9130 1.4585 1.3413 1.2844 1.3311 1.3951 1.5168 1.4084 1.4956 1.4397 4.3458 1.4907 1.2316 2.1451 1.1664 1.0864 1.0840 1.0923 1.0753 1.0782 2.7946 1.1916 1.0906 1.0531 1.4469 1.3926 5.7968 6.8965 7.9030 1.0545 1.0645 1.0671 1.0363 1.0625 1.0654 1.0643 1.0756 1.0771 1.0742 1.1007 1.1020 1.0952 1.0997 1.1014 1.0968 1.1005 1.0936 1.1002 1.0876 1.0928 1.0981 1.0753
irintensity: 0.0539 0.3838 0.3013 0.9151 1.0805 2.6853 1.7776 1.1279 0.9526 5.4303 0.1861 2.4805 0.6904 2.3493 0.8841 5.6671 0.8761 2.9194 2.9951 4.2928 0.7707 4.6595 10.1971 6.3847 1.2878 6.1798 5.4848 11.8921 0.8807 3.2603 2.9485 6.1191 67.7160 17.7198 2.4420 16.1692 3.6618 57.0238 5.5562 18.6765 61.0113 0.8988 11.9115 8.7282 0.3907 1.1091 16.6843 1.6153 0.8253 17.5723 52.8768 1.5102 2.6680 6.0199 386.9544 41.2270 44.2818 26.7243 10.3070 0.5035 1.8281 0.3432 6.7040 22.1143 0.1449 36.0229 44.4525 29.3802 425.7789 53.0776 41.9719 13.9223 7.4483 11.5679 8.0590 13.7661 4.9466 35.7591 12.8303 0.2576 0.4901 0.9141 0.5333 17.6074 9.2216 14.4571 10.7692 47.8700 1.9619 24.2604 43.3153 10.5797 2.5132 6.2909 39.0521 13.5268 19.0486 10.4734 38.4433 19.8096 1.6385 284.3693 246.5135 17.2402 18.9332 168.5600 95.6192 6.6139 5.0939 21.0288 14.6441 20.3200 78.2468 141.4023 1.3728 72.7284 17.5660 3.2651 11.1778 26.2693 103.5551 8.7938 30.3978 37.2058 18.0683 6.9465 15.3260 9.0456 41.6595
temp: 298.150 k
press: 1.00000 atm
elementType: 17 8 8 7 7 6 6 6 6 6 6 6 6 6 6 6 6 6 6 6 6 6 1 1 1 1 1 1 1 1 1 1 1 1 1 1 1 1 1 1 1 1 1 1 1
symmnumber: 1
zpe: 982899.9 jmol-1
zpe.correction: 0.374367 hartree
zpe.thermalcorrener: 0.395347 hartree
zpe.thermalcorrenthalpy: 0.396291 hartree
zpe.thermalcorrgfe: 0.322537 hartree
zpe.sumelectzpe: -1379.966314 hartree
zpe.sumelectthermal: -1379.945333 hartree
zpe.sumelectthermalent: -1379.944389 hartree
zpe.sumelectthermalfe: -1380.018143 hartree
dipole: 0.0680 -0.1811 -1.2454
dipole: 1.2604
quadrupole: -125.2015 -135.0139 -138.7488
quadrupole: -4.9543 2.4259 2.2302
quadrupole: 7.7866 -2.0259 -5.7607 -4.9543 2.4259 2.2302
hfenergy: -1380.3406804 hartree
pointgroup: C01 [X(C17H23Cl1N2O2)]
dipole: -0.0235629 -0.3222972 0.3761118 debye
polarizability: 273.3334999|-5.4460709|196.2993381|13.2993138|30.1395146|165.6729373 unknown
InChI: InChI=1S/C17H23ClN2O2/c1-11-5-3-8-15(18)16(11)19-17(21)22-14-9-12-6-4-7-13(10-14)20(12)2/h3,5,8,12-14,19H,4,6-7,9-10H2,1-2H3
charge 0 multiplicity 1
45 atoms
Cl -3.353301 2.525515 1.755726
O  0.31042 -0.111236 0.959798
O  -0.804184 -0.583614 -1.067686
N  4.400034 0.841645 0.469485
N  -1.945988 -0.008909 0.931051
C  4.122797 -0.535804 0.963493
C  3.569177 1.126769 -0.733797
C  2.620426 -0.713607 1.377218
C  2.035603 1.032877 -0.416876
C  4.626207 -1.54474 -0.102331
C  4.048589 0.205884 -1.886146
C  1.642109 -0.290886 0.269935
C  4.035368 -1.298976 -1.514342
C  4.376957 1.892183 1.504295
C  -0.824042 -0.265521 0.147226
C  -3.293496 0.027444 0.472079
C  -3.895361 -1.060532 -0.234541
C  -4.097759 1.15469 0.789841
C  -5.247062 -0.9307 -0.642395
C  -3.14098 -2.345017 -0.504586
C  -5.442853 1.267868 0.407197
C  -6.015643 0.212157 -0.336507
H  4.72975 -0.688436 1.877661
H  3.773209 2.172799 -1.036216
H  2.426002 -1.759871 1.677904
H  2.424643 -0.080661 2.264429
H  1.770771 1.861374 0.269429
H  1.443713 1.167055 -1.340278
H  5.726411 -1.434972 -0.150637
H  4.410479 -2.579395 0.22961
H  3.430697 0.382654 -2.787929
H  5.085454 0.507977 -2.128477
H  1.488052 -1.085975 -0.477253
H  4.621594 -1.867849 -2.261374
H  3.005708 -1.69642 -1.575446
H  3.383682 2.066861 1.984856
H  4.703962 2.848584 1.056694
H  5.094355 1.630639 2.303655
H  -1.745245 0.430893 1.833899
H  -5.706925 -1.759823 -1.191618
H  -2.408262 -2.209051 -1.319436
H  -2.567911 -2.664152 0.385809
H  -3.839221 -3.153753 -0.778402
H  -6.019543 2.157775 0.673471
H  -7.059991 0.279757 -0.657691
