program: Gaussian 09
title: 000207211
version: EM64L-G09RevD.01
frameworkgroup: C1[X(C19H19NO2)]
method: RPBEPBE
basis: SDD
operation: Freq
keyword: #p
keyword: freq=noraman
keyword: PBEPBE/SDD
title: #p freq=noraman PBEPBE/SDD
converged: YES YES NO NO
title: Mulliken charges:
elementType: O O N C C C C C C C C C C C C C C C C C C C H H H H H H H H H H H H H H H H H H H
charge: -0.283902 -0.240825 -0.100120 -0.370781 -0.362909 -0.398689 -0.391292 -0.398765 -0.458538 0.333244 -0.020703 0.208740 -0.372266 -0.391125 -0.248950 0.040721 0.173935 0.200859 -0.350090 -0.365400 -0.251383 -0.210388 0.230139 0.180683 0.168137 0.211929 0.203882 0.195504 0.193100 0.203802 0.190058 0.215739 0.231161 0.223508 0.283172 0.281085 0.233294 0.280317 0.261152 0.236345 0.235619
chargesum: 0.00000
title: Mulliken charges with hydrogens summed into heavy atoms:
elementType: O O N C C C C C C C C C C C C C C C C C C C
charge: -0.283902 -0.240825 -0.100120 0.040041 0.017158 0.000698 0.005610 0.007032 -0.003870 0.333244 -0.020703 0.208740 -0.089093 -0.110040 -0.015655 0.040721 0.173935 0.200859 -0.069773 -0.104248 -0.015038 0.025232
polarizability: 3.05550436e+02 -2.00948492e+01 2.42078747e+02 1.45441341e+01 3.32695391e+00 1.20507223e+02
1716.lowfreq: -6.4459 -0.0003 0.0002 0.0008 3.5207 9.0837 21.8860 44.7628 50.2512
frequency: 21.7878 44.7590 50.1969 73.7076 90.6170 120.8126 142.8881 187.8948 204.6451 236.0973 251.8022 256.7993 294.6922 298.4216 306.0839 324.1610 374.8601 388.2422 422.1226 426.0569 450.5553 472.8356 492.4363 507.8004 519.9010 544.7918 563.8120 579.0293 622.9809 655.4472 671.3371 679.3090 728.9382 764.9981 768.7976 790.5746 795.3318 806.3737 832.4485 841.2075 853.2627 857.7696 880.3286 883.8913 900.5786 953.5906 959.9323 965.2596 973.4503 991.1728 1000.5267 1003.2933 1012.1075 1026.3414 1048.8793 1059.9786 1082.0339 1095.3840 1113.7724 1121.2099 1150.6664 1156.0770 1161.6118 1167.0700 1171.1760 1193.1332 1195.9630 1209.6194 1244.7383 1253.2803 1261.9470 1263.9978 1280.1467 1292.2318 1312.4637 1330.3430 1337.4550 1340.9997 1350.3936 1364.1923 1381.8863 1398.7379 1403.6388 1421.5016 1448.9925 1453.3559 1454.6069 1461.1120 1461.3325 1465.6159 1468.9284 1472.8716 1481.6983 1555.9515 1576.4224 1601.6508 1606.4912 1625.7176 2826.3511 2836.6292 2889.2547 2969.4115 2985.4311 2985.9593 2993.2162 3021.2286 3032.3752 3037.5649 3045.8857 3055.2008 3136.8669 3139.1565 3151.5013 3151.6997 3164.9337 3167.5201 3175.6149
redmass: 4.1499 3.5734 4.2183 5.4942 4.2236 4.0481 5.9776 2.8945 4.0753 2.6633 4.0844 3.4778 5.4390 3.5702 2.2483 4.0703 5.0145 1.9426 3.8595 3.9399 2.9131 3.8601 3.8585 8.8568 3.6111 3.8077 2.0755 7.2039 6.6006 5.3927 6.0455 4.4660 4.4481 3.6582 1.5716 1.5715 5.7796 1.4859 1.9826 5.3040 2.6303 1.5951 5.5160 1.5273 2.2653 1.5460 1.4315 2.7756 1.3734 1.6693 1.3343 2.5689 1.4408 2.0133 2.0817 1.9475 1.3894 2.2251 2.3592 2.5903 1.3355 2.1544 1.2388 2.4901 1.2239 1.3167 2.1948 3.0777 2.2309 1.6518 1.3682 1.2292 1.4066 1.4043 2.1276 1.3671 1.6387 1.4184 1.4983 1.4758 1.6636 9.0486 5.5538 2.6602 2.7836 1.1781 1.2257 1.1255 2.1662 1.7981 1.0994 1.2258 1.0994 9.3404 7.1163 7.0871 7.9105 7.4639 1.0716 1.0704 1.0690 1.0624 1.0616 1.0618 1.0878 1.0874 1.0910 1.0930 1.1032 1.1038 1.0868 1.0860 1.0900 1.0915 1.0953 1.0986 1.1002
irintensity: 0.2078 0.5896 0.2812 3.9046 0.2241 0.2402 0.0776 1.2538 2.0411 1.8289 1.1198 0.2930 0.4335 4.0208 5.4071 7.7399 4.5176 2.4942 0.4738 0.9322 0.4680 2.3871 6.0603 0.5682 2.4985 1.2968 4.0299 0.7984 13.0873 1.8427 1.6543 7.1008 4.8935 6.8831 123.7515 1.7214 2.7269 0.0631 25.6363 4.2595 6.6012 2.6917 35.8478 0.1678 1.2059 7.0301 1.2712 9.3761 3.0400 10.6606 0.2773 20.3781 6.7087 5.9647 11.9762 22.7426 3.6429 23.4231 44.6673 3.9911 7.3634 42.4889 7.5262 9.1245 2.1387 2.8229 45.6639 58.2779 31.3233 5.3547 5.3023 3.4824 14.6547 8.3562 138.5611 26.3564 41.4140 0.3599 5.3571 7.0259 16.1135 14.0826 7.5440 113.0492 62.6881 23.3704 19.2824 9.0568 15.7089 44.9003 6.8510 4.7210 5.6062 166.7232 58.0653 79.1819 85.7467 17.0959 47.1409 130.2634 54.5900 39.1356 30.9375 35.6338 9.2862 64.8690 73.8347 26.4724 21.1702 89.8531 2.4683 3.6641 5.2618 2.6623 13.1696 16.7751 19.2783
temp: 298.150 k
press: 1.00000 atm
elementType: 8 8 7 6 6 6 6 6 6 6 6 6 6 6 6 6 6 6 6 6 6 6 1 1 1 1 1 1 1 1 1 1 1 1 1 1 1 1 1 1 1
symmnumber: 1
zpe: 878849.3 jmol-1
zpe.correction: 0.334736 hartree
zpe.thermalcorrener: 0.352593 hartree
zpe.thermalcorrenthalpy: 0.353537 hartree
zpe.thermalcorrgfe: 0.288142 hartree
zpe.sumelectzpe: -939.056949 hartree
zpe.sumelectthermal: -939.039092 hartree
zpe.sumelectthermalent: -939.038148 hartree
zpe.sumelectthermalfe: -939.103544 hartree
dipole: -2.7944 -3.5296 -0.0904
dipole: 4.5028
quadrupole: -122.7401 -123.6151 -131.6286
quadrupole: -15.1017 -0.1186 -0.1488
quadrupole: 3.2545 2.3795 -5.6341 -15.1017 -0.1186 -0.1488
hfenergy: -939.3916854 hartree
pointgroup: C01 [X(C19H19N1O2)]
dipole: 1.0779665 1.4010926 -0.1151042 debye
polarizability: 306.9863458|-19.5145882|239.8604539|-5.9400752|-14.5078699|121.2896059 unknown
InChI: InChI=1S/C19H19NO2/c21-18-15-8-2-3-10-17(15)22-19-14(7-6-9-16(18)19)13-20-11-4-1-5-12-20/h2-3,6-10H,1,4-5,11-13H2
charge 0 multiplicity 1
41 atoms
O  -1.042217 0.880715 -0.331994
O  -3.662759 -2.342466 0.319846
N  3.170677 0.418495 -0.219416
C  3.381956 0.491197 1.250811
C  4.104107 1.312645 -0.950825
C  4.826493 0.102864 1.624486
C  5.570433 0.94349 -0.647177
C  5.844552 0.991482 0.873691
C  1.756559 0.648079 -0.589832
C  0.869673 -0.56605 -0.322127
C  -0.538436 -0.432239 -0.209556
C  -1.397058 -1.545025 0.007454
C  1.404653 -1.866373 -0.220005
C  -0.815944 -2.837474 0.107246
C  0.573438 -2.997563 -0.006753
C  -2.866848 -1.367313 0.124603
C  -3.343432 0.033911 -0.001912
C  -2.42596 1.096241 -0.222031
C  -4.726308 0.347927 0.092786
C  -2.85637 2.435501 -0.346086
C  -5.171158 1.674022 -0.027903
C  -4.230789 2.718775 -0.247953
H  2.663227 -0.190108 1.741599
H  3.167804 1.526382 1.628374
H  3.935594 2.388321 -0.677131
H  3.904569 1.212743 -2.034518
H  4.992433 -0.958611 1.355944
H  4.958881 0.195193 2.719548
H  6.243083 1.636398 -1.188363
H  5.764293 -0.078632 -1.026268
H  5.751879 2.038397 1.23022
H  6.879441 0.666627 1.091417
H  1.718578 0.874607 -1.674546
H  1.322713 1.54011 -0.07748
H  2.491714 -1.965094 -0.312169
H  -1.490941 -3.683384 0.272569
H  1.021046 -3.994008 0.067434
H  -5.418971 -0.483231 0.261793
H  -2.114793 3.221542 -0.515436
H  -6.238136 1.907014 0.046307
H  -4.575975 3.75399 -0.342349
