program: Gaussian 09
title: 000207172
version: EM64L-G09RevD.01
frameworkgroup: C1[X(C22H20N2O3)]
method: RPBEPBE
basis: SDD
operation: Freq
keyword: #p
keyword: freq=noraman
keyword: PBEPBE/SDD
title: #p freq=noraman PBEPBE/SDD
converged: YES YES NO NO
title: Mulliken charges:
elementType: O O O N N C C C C C C C C C C C C C C C C C C C C C C H H H H H H H H H H H H H H H H H H H H
charge: -0.508616 -0.291838 -0.273542 -0.491691 -0.484478 0.067615 0.288431 -0.419221 0.486308 0.255387 0.513251 0.123238 0.117453 -0.340466 -0.395701 0.488576 -0.480346 0.495443 -0.622722 -0.472045 -0.369395 -0.456533 -0.422043 -0.187647 -0.204226 -0.813990 -0.810592 0.254218 0.284460 0.388124 0.320961 0.224102 0.308129 0.224404 0.224770 0.309933 0.232800 0.231401 0.222620 0.224111 0.234195 0.233476 0.219433 0.224702 0.237313 0.225468 0.384771
chargesum: 0.00000
title: Mulliken charges with hydrogens summed into heavy atoms:
elementType: O O O N N C C C C C C C C C C C C C C C C C C C C C C
charge: -0.123846 -0.291838 -0.273542 -0.103567 -0.163517 0.067615 0.288431 -0.165003 0.486308 0.255387 0.513251 0.123238 0.117453 -0.056005 -0.171599 0.488576 -0.172218 0.495443 -0.398319 -0.247275 -0.059463 -0.223733 -0.190642 0.034973 0.019885 -0.126885 -0.123109
polarizability: 4.56618878e+02 -7.16803130e+00 3.33842581e+02 8.52666069e+00 6.42141591e-01 1.12600975e+02
1716.lowfreq: -3.8117 -0.6457 -0.0008 0.0003 0.0009 4.2338 7.8411 15.1919 24.1599
frequency: 7.5931 15.1431 24.1260 30.8130 38.2257 40.4553 44.3966 69.7677 82.9025 95.4973 117.5525 150.1792 153.1894 178.2481 209.3416 210.3285 228.3438 240.5475 258.4909 270.7820 299.9706 323.9156 328.4419 352.1456 371.0670 391.2837 399.8076 429.3078 433.1306 442.0327 443.4938 512.9974 516.7413 525.0331 533.4120 556.6470 563.9595 577.0368 595.6785 640.5747 650.8515 665.4821 680.1178 699.2517 701.6618 734.7890 737.6594 754.5242 756.0755 779.6856 803.4840 804.5204 823.3540 830.0219 850.0609 875.9678 887.3401 902.1192 922.1674 927.9297 938.0632 938.2594 944.1692 971.9850 983.0969 984.8814 985.6480 995.7277 1002.4569 1013.4117 1047.6973 1050.9443 1064.1255 1096.8815 1100.2722 1102.9158 1120.9812 1160.0307 1174.1580 1182.5188 1182.5621 1190.7073 1220.4643 1240.4443 1264.1971 1275.6999 1286.1750 1301.6917 1307.7222 1316.7217 1382.2061 1387.0854 1395.8900 1397.7775 1397.8959 1400.5720 1409.0414 1437.2965 1468.0509 1468.9732 1469.3278 1473.9673 1482.5108 1485.2885 1486.9772 1532.6886 1553.9112 1578.2396 1585.1087 1602.2994 1603.8548 1613.3181 1621.0128 1621.9503 1638.2661 2976.1571 2978.2610 3057.6413 3057.8913 3084.7034 3085.6985 3097.4206 3115.8513 3116.3833 3120.4456 3125.1614 3130.4684 3149.4470 3155.1533 3167.9919 3179.0817 3200.6062 3390.8767 3535.3667 3597.8982
redmass: 1.3221 2.1956 4.6334 5.0716 5.3033 1.0688 4.7631 5.5886 5.3478 6.1834 6.4603 5.1127 5.6008 5.1941 3.0540 3.0677 5.5417 4.2886 4.8923 4.5621 5.6723 4.9774 3.7958 1.3084 6.9182 3.7958 3.8289 3.4864 6.4479 2.8188 2.8764 5.1562 5.1316 4.4127 4.7194 7.2004 2.9910 3.6858 5.9770 7.2800 1.4735 4.6687 6.6789 1.9047 2.1163 6.1456 5.0559 5.5675 3.6518 1.5420 1.5359 4.6857 1.2608 1.5323 7.4300 1.4314 1.3396 4.4520 1.3933 3.2474 2.5220 1.4054 1.5531 1.3460 1.3622 5.6748 5.7852 1.3250 1.6115 1.6439 1.5596 1.5699 2.7214 1.6564 2.1638 1.7474 1.8218 1.1705 1.7633 1.0928 1.0821 1.7822 2.7446 3.3182 2.7139 2.2668 2.3522 1.4802 1.5331 1.5413 6.5744 4.7371 3.1122 1.2316 1.7100 5.2962 2.6207 3.2450 1.5324 1.3809 1.1720 1.0540 2.3646 1.4990 1.9427 2.2412 3.1034 6.1026 4.5495 5.1886 5.3925 6.1030 6.1703 5.4730 2.6458 1.0384 1.0369 1.0954 1.0976 1.0991 1.0996 1.0913 1.0872 1.0903 1.0904 1.0873 1.0906 1.0961 1.0991 1.0945 1.0928 1.0949 1.0796 1.0757 1.0663
irintensity: 1.2575 2.5387 0.5567 0.4867 4.1005 0.5895 1.0165 4.0608 1.3982 0.5101 1.5398 0.6783 5.0450 5.2138 0.1535 6.6986 0.2205 2.5887 0.3627 3.0920 14.5769 10.9634 17.8155 120.1777 2.0607 0.9713 0.1839 0.5650 2.8798 1.9842 13.9768 2.3582 5.9093 10.6944 3.0996 45.0751 12.8826 0.4675 19.5266 8.1880 27.7924 27.4794 12.0937 23.5155 23.5030 0.6394 23.4036 5.7358 2.5384 4.3406 52.0083 11.7088 72.8325 93.8807 2.4689 15.3407 5.0104 9.9857 9.2907 11.5282 5.5190 17.4949 19.6943 0.2027 1.4505 1.5351 0.3078 3.5641 2.1564 2.8051 18.5306 17.7626 130.4816 16.8826 23.3677 36.8529 85.8839 2.9176 12.1088 1.0607 2.2517 2.7664 49.2582 179.1241 43.1139 35.9034 52.6444 42.1075 2.8130 82.8224 117.2748 13.9601 1.4477 13.8935 19.0548 3.0946 68.2590 136.7770 110.3306 5.8077 12.6266 14.5572 55.9204 114.5500 140.4399 258.3779 465.8543 90.1057 9.9838 100.1950 58.2437 168.1422 4.0707 89.1939 42.8642 34.5738 33.4093 21.1409 20.8517 24.5724 15.0114 20.5458 6.2830 20.6739 13.5452 8.9184 20.3588 32.2048 32.8559 4.0012 6.9240 7.7014 137.9842 11.9442 78.6374
temp: 298.150 k
press: 1.00000 atm
elementType: 8 8 8 7 7 6 6 6 6 6 6 6 6 6 6 6 6 6 6 6 6 6 6 6 6 6 6 1 1 1 1 1 1 1 1 1 1 1 1 1 1 1 1 1 1 1 1
symmnumber: 1
zpe: 967481.6 jmol-1
zpe.correction: 0.368494 hartree
zpe.thermalcorrener: 0.393331 hartree
zpe.thermalcorrenthalpy: 0.394275 hartree
zpe.thermalcorrgfe: 0.308626 hartree
zpe.sumelectzpe: -1183.677347 hartree
zpe.sumelectthermal: -1183.652510 hartree
zpe.sumelectthermalent: -1183.651566 hartree
zpe.sumelectthermalfe: -1183.737215 hartree
dipole: 3.1942 -1.8299 0.8750
dipole: 3.7838
quadrupole: -147.3715 -126.8922 -166.2053
quadrupole: -25.0608 -0.1138 -1.9038
quadrupole: -0.5486 19.9308 -19.3823 -25.0608 -0.1138 -1.9038
hfenergy: -1184.045841 hartree
pointgroup: C01 [X(C22H20N2O3)]
dipole: 1.2399584 0.6050968 0.5590054 debye
polarizability: 455.7977373|19.1410752|139.1360701|1.9958003|71.011408|308.1286257 unknown
InChI: InChI=1S/C22H20N2O3/c1-14-5-3-7-17(11-14)23-21(26)16-9-10-20(25)19(13-16)22(27)24-18-8-4-6-15(2)12-18/h3-13,23-25H,1-2H3
charge 0 multiplicity 1
47 atoms
O  2.471267 1.388567 3.212649
O  1.469812 -0.344353 -0.578642
O  -3.90019 0.535598 2.724978
N  3.205087 0.370052 0.835405
N  -3.320188 0.086661 0.49432
C  0.860827 0.56517 1.57712
C  -1.560375 0.650968 2.113309
C  -0.495659 0.330744 1.242657
C  4.353852 0.088649 0.045126
C  1.129381 1.142117 2.850007
C  -4.587125 -0.214922 -0.083585
C  1.8721 0.159509 0.521224
C  -3.021813 0.417247 1.812633
C  -1.253195 1.215492 3.378953
C  0.079552 1.461281 3.743024
C  5.490068 -0.747242 -1.97074
C  4.297514 -0.49667 -1.245851
C  -5.808771 -0.81314 -2.147068
C  -4.605621 -0.499544 -1.47602
C  5.614832 0.425267 0.613518
C  -5.797417 -0.238129 0.658837
C  6.739457 -0.407616 -1.395379
C  -7.014469 -0.831565 -1.398394
C  6.796332 0.176412 -0.1078
C  -6.99768 -0.548706 -0.014911
C  5.412763 -1.377072 -3.351658
C  -5.804603 -1.146482 -3.629535
H  -0.635133 -0.139186 0.260795
H  -2.082069 1.443642 4.056003
H  3.379345 0.789015 1.760067
H  -2.536974 0.068225 -0.161949
H  0.308739 1.901141 4.722423
H  3.323074 -0.749159 -1.669894
H  -3.665526 -0.47736 -2.0456
H  5.661509 0.877842 1.612048
H  -5.780531 -0.011971 1.72568
H  7.664261 -0.598955 -1.951798
H  -7.960089 -1.065965 -1.901164
H  7.765074 0.43742 0.33261
H  -7.934846 -0.563915 0.552993
H  4.941909 -2.377084 -3.308613
H  4.801328 -0.762122 -4.038047
H  6.414215 -1.493067 -3.800493
H  -5.01213 -0.598176 -4.169165
H  -5.626705 -2.227133 -3.793358
H  -6.772265 -0.898054 -4.099415
H  2.541572 1.780073 4.116798
