program: Gaussian 09
title: 000206962
version: EM64L-G09RevD.01
frameworkgroup: C1[X(C8H16N2S2)]
method: RPBEPBE
basis: SDD
operation: Freq
keyword: #p
keyword: freq=noraman
keyword: PBEPBE/SDD
title: #p freq=noraman PBEPBE/SDD
converged: YES YES NO NO
title: Mulliken charges:
elementType: S S N N C C C C C C C C H H H H H H H H H H H H H H H H
charge: -0.017716 0.008878 -0.080274 0.049924 -0.038188 -0.074007 -0.398088 -0.408357 -0.755929 -0.710731 -0.661031 -0.536348 0.244357 0.215155 0.226589 0.242901 0.257860 0.236891 0.224852 0.214566 0.243769 0.226997 0.233097 0.223867 0.229723 0.191840 0.247993 0.161412
chargesum: 0.00000
title: Mulliken charges with hydrogens summed into heavy atoms:
elementType: S S N N C C C C C C C C
charge: 0.143696 0.008878 -0.080274 0.049924 0.206169 0.141147 0.071402 0.086394 -0.072743 -0.026770 0.008524 -0.536348
polarizability: 1.72405394e+02 -7.28710912e+00 1.43395278e+02 9.55662392e+00 3.74964615e+00 9.06472870e+01
1716.lowfreq: -29.0138 -13.4807 -0.0029 -0.0028 -0.0022 7.7967 42.5742 49.0182 97.2584
frequency: 40.9437 48.8402 97.2312 116.0912 174.5715 181.5643 200.1007 219.8302 247.5381 282.2262 293.1621 298.6113 317.4433 341.9635 364.9517 388.1764 402.4397 436.9685 478.5573 520.4993 527.0185 572.6526 681.8502 705.1507 792.7136 828.1816 854.7845 876.2544 897.0873 931.5235 936.2540 985.0501 1027.4383 1045.8241 1081.1807 1095.0726 1107.7066 1117.8005 1123.7802 1158.0007 1189.3397 1213.2479 1230.8707 1247.2292 1282.8994 1293.4785 1329.8828 1337.5317 1349.9948 1365.5867 1388.0827 1388.9779 1434.7872 1443.6346 1451.9892 1461.0748 1467.8290 1473.4929 1478.4839 1480.9262 1486.3629 1491.3181 2464.9534 2869.3800 2971.3232 2976.9152 2985.4845 2994.1441 3003.1910 3004.6650 3031.4411 3076.7659 3078.0106 3085.3975 3089.6053 3090.5678 3092.2412 3101.5034
redmass: 4.8238 6.4893 3.5982 2.5053 1.2153 1.1701 2.5347 2.7286 1.2251 3.4072 3.3802 2.2595 1.3183 2.1932 3.1705 3.2176 2.8695 3.6028 3.3301 2.6839 5.3226 5.0029 2.8705 3.4028 2.7359 1.6904 1.7630 2.2106 1.7952 1.9555 1.9721 2.7197 1.8308 2.1001 1.7017 1.7802 1.6374 2.5935 1.8862 3.1179 2.6289 2.3613 1.3195 1.4761 1.4544 1.3118 1.3077 1.3777 1.3586 1.3101 1.2217 1.2301 1.3485 1.4601 1.0771 1.1560 1.1607 1.0488 1.2505 1.0647 1.0525 1.0545 1.0374 1.0573 1.0671 1.0662 1.0370 1.0383 1.0834 1.0817 1.0730 1.0988 1.0975 1.0965 1.0984 1.0988 1.0994 1.1007
irintensity: 0.6777 0.0914 0.9293 1.2355 0.3673 0.1639 1.0224 1.7398 0.1492 3.0541 2.9298 19.4296 20.6069 0.3552 4.2941 2.8856 11.4076 5.6446 9.2268 17.6203 8.0918 5.3321 12.8521 18.2492 17.7562 19.9819 24.3727 25.5244 9.4072 22.4381 6.4605 50.3112 50.5054 5.8722 6.3241 28.2679 13.7226 57.0845 10.8996 18.0754 65.3806 7.1194 53.3150 40.0877 36.3791 24.4161 4.2072 2.5573 4.9087 0.0222 13.9324 22.9141 94.2906 61.5229 13.4514 33.3206 81.4713 10.2634 31.3796 14.4594 4.8842 2.8844 4.3923 89.6540 14.5759 43.5121 29.0162 9.5986 39.1780 36.0603 50.7124 21.4823 8.2642 19.4056 37.4444 30.2741 21.5340 24.5146
temp: 298.150 k
press: 1.00000 atm
elementType: 16 16 7 7 6 6 6 6 6 6 6 6 1 1 1 1 1 1 1 1 1 1 1 1 1 1 1 1
symmnumber: 1
zpe: 610093.4 jmol-1
zpe.correction: 0.232372 hartree
zpe.thermalcorrener: 0.246349 hartree
zpe.thermalcorrenthalpy: 0.247293 hartree
zpe.thermalcorrgfe: 0.191729 hartree
zpe.sumelectzpe: -1219.086712 hartree
zpe.sumelectthermal: -1219.072736 hartree
zpe.sumelectthermalent: -1219.071792 hartree
zpe.sumelectthermalfe: -1219.127355 hartree
dipole: -4.0223 1.3397 -0.8910
dipole: 4.3321
quadrupole: -94.4596 -87.8839 -89.8788
quadrupole: 4.4300 5.0006 1.4296
quadrupole: -3.7188 2.8569 0.8619 4.4300 5.0006 1.4296
hfenergy: -1219.3190847 hartree
pointgroup: C01 [X(C8H16N2S2)]
dipole: -1.5562587 -0.611508 0.3302668 debye
polarizability: 170.9494965|10.2217464|140.4573896|-12.4511355|12.5676987|95.0410731 unknown
InChI: InChI=1S/C8H16N2S2/c1-6-4-10(8(11)12)5-7(2)9(6)3/h6-7,11H,4-5H2,1-3H3
charge 0 multiplicity 1
28 atoms
S  2.877769 -1.717071 -0.674578
S  3.313865 1.234426 0.178059
N  -1.909681 0.325764 0.002755
N  0.947586 -0.14222 0.426946
C  -1.224683 -0.864477 -0.577478
C  -0.954861 1.463836 0.192912
C  0.023652 -1.293764 0.262723
C  0.283824 1.036444 1.041958
C  -2.170881 -2.059088 -0.788284
C  -0.530843 2.091902 -1.151459
C  -2.755242 0.069081 1.190192
C  2.261358 -0.10765 0.04539
H  -0.847191 -0.555198 -1.57104
H  -1.495696 2.234858 0.776046
H  -0.293216 -1.639978 1.268011
H  0.536881 -2.130297 -0.236967
H  1.02481 1.849183 1.107874
H  -0.030998 0.754739 2.06702
H  -1.67456 -2.832039 -1.401919
H  -2.47625 -2.530861 0.163585
H  -3.079717 -1.730205 -1.321769
H  0.153021 1.440159 -1.722665
H  -1.425401 2.290107 -1.766007
H  0.001005 3.043707 -0.975822
H  -3.244626 1.014829 1.483268
H  -2.216223 -0.323568 2.087365
H  -3.553362 -0.648524 0.938044
H  4.146561 -1.207994 -0.866763
