program: Gaussian 09
title: 000206959
version: EM64L-G09RevD.01
frameworkgroup: C1[X(C6H11N3O2)]
method: RPBEPBE
basis: SDD
operation: Freq
keyword: #p
keyword: freq=noraman
keyword: PBEPBE/SDD
title: #p freq=noraman PBEPBE/SDD
converged: YES YES NO NO
title: Mulliken charges:
elementType: O O N N N C C C C C C H H H H H H H H H H H
charge: -0.271660 -0.217978 -0.391875 -0.084636 -0.642793 -0.197026 -0.428144 -0.484924 0.196259 0.243880 -0.501322 0.258536 0.230494 0.231741 0.212003 0.221400 0.294830 0.290975 0.321293 0.244131 0.233639 0.241177
chargesum: 0.00000
title: Mulliken charges with hydrogens summed into heavy atoms:
elementType: O O N N N C C C C C C
charge: -0.271660 -0.217978 -0.097045 -0.084636 -0.030526 0.061510 0.034091 -0.051520 0.196259 0.243880 0.217625
polarizability: 1.05454725e+02 -9.41535093e+00 8.92914746e+01 -2.41038144e+00 -4.14700959e+00 7.27113582e+01
1716.lowfreq: -11.1842 -10.5617 -3.3861 -0.0011 -0.0005 0.0006 13.3409 60.7666 87.9736
frequency: 12.9845 60.7589 87.9714 104.5554 163.4660 195.7107 217.4740 263.4180 303.5540 338.0217 350.1984 381.0289 400.5942 479.1071 548.7455 572.5028 609.2893 664.1154 687.0614 742.1695 796.7463 848.9102 886.0384 905.3212 949.4518 962.6253 1045.6067 1055.8292 1112.3432 1118.7441 1147.5445 1156.3323 1171.9986 1193.0530 1215.9029 1260.6721 1317.4888 1327.1252 1334.2808 1345.2244 1421.0199 1452.0490 1453.0526 1464.6117 1470.3663 1489.0092 1608.1467 1654.7177 1664.8805 2950.8741 3004.6159 3005.0869 3015.4468 3026.1147 3086.7395 3106.9959 3149.5206 3514.7111 3583.7732 3659.8532
redmass: 6.2472 5.1395 3.0281 1.1015 3.6466 1.8582 2.6828 1.7024 3.2291 2.8790 3.0154 1.3754 3.2269 3.8856 3.6749 1.6399 3.5874 3.3502 5.3451 3.6089 5.6897 2.9498 2.7081 3.5521 4.4999 2.5548 1.8030 1.9945 1.2731 4.5756 1.4291 2.1440 1.5107 1.5062 1.9123 1.2398 1.7971 1.5162 1.3502 1.4983 1.1698 1.0976 1.0506 1.0516 1.1004 2.2509 1.2167 9.9175 4.6129 1.0683 1.0482 1.0516 1.0875 1.0812 1.1024 1.1046 1.1049 1.0453 1.0782 1.1009
irintensity: 0.8825 0.1308 7.3108 0.5752 14.7126 44.9184 46.7923 14.4985 16.5930 4.7074 22.8956 90.0315 13.4088 1.8960 32.1050 212.4632 26.0754 1.6588 75.9241 12.9973 1.7054 11.1407 9.4589 8.0810 22.5500 5.5427 22.8802 25.2780 2.9574 271.0444 7.0539 22.9712 1.7540 7.0920 8.0721 12.1375 45.3612 31.8141 0.9597 23.6689 10.0851 18.2845 15.1755 15.7726 2.7583 219.4903 65.9728 209.5882 285.9354 65.5052 28.0415 10.8827 35.4351 53.1950 25.3715 25.5553 15.7921 21.3075 15.6106 20.6552
temp: 298.150 k
press: 1.00000 atm
elementType: 8 8 7 7 7 6 6 6 6 6 6 1 1 1 1 1 1 1 1 1 1 1
symmnumber: 1
zpe: 467234.8 jmol-1
zpe.correction: 0.177960 hartree
zpe.thermalcorrener: 0.189724 hartree
zpe.thermalcorrenthalpy: 0.190668 hartree
zpe.thermalcorrgfe: 0.138829 hartree
zpe.sumelectzpe: -549.070952 hartree
zpe.sumelectthermal: -549.059189 hartree
zpe.sumelectthermalent: -549.058245 hartree
zpe.sumelectthermalfe: -549.110083 hartree
dipole: -2.2869 -0.9234 2.4029
dipole: 3.4434
quadrupole: -57.6618 -62.1248 -65.5867
quadrupole: -7.7223 2.9995 -2.6483
quadrupole: 4.1293 -0.3337 -3.7956 -7.7223 2.9995 -2.6483
hfenergy: -549.2489125 hartree
pointgroup: C01[X(C6H11N3O2)]
dipole: 0.9395282 -0.3526881 -0.9100345 debye
dipolederiv: -1.4221689 -0.1997799 -0.0750623 -0.2999118 -0.461982 0.0831247 -0.1100656 0.1133462 -0.3939309 -0.6276046 0.0409828 -0.0867083 -0.2118898 -0.6474947 0.2274068 0.0744501 0.3594873 -0.5033577 -0.9790618 0.1320327 0.2470823 0.0757356 -0.5126302 -0.0025833 0.3391831 -0.0491176 -0.5950445 -0.51514 -0.0176323 0.0853982 -0.1955626 -0.9684026 -0.2421047 -0.0085127 -0.2971531 -0.5988197 -1.0238017 -0.5527068 -0.1991178 -0.4718444 -0.6201902 -0.0057079 -0.2749305 -0.092555 -0.6380296 0.5659247 0.089524 -0.0393891 0.3380794 0.0798077 -0.0307661 -0.0093079 0.0424021 0.1471494 -0.0458442 -0.065171 0.0653439 -0.1696751 0.02612 -0.0458712 0.0309875 0.0052615 -0.0006034 0.3216999 0.1649976 0.0867762 0.1289744 0.4580276 0.0565938 0.0630719 -0.0097182 0.2325435 1.2839627 0.3375598 -0.3694207 0.4014239 1.2260515 0.4929179 -0.5074146 0.4858394 0.7802955 1.4107826 0.1589748 0.1168232 0.4971084 0.7385672 -0.3346567 -0.050303 -0.540161 0.5173664 0.5752991 -0.0050005 0.0852431 -0.0664711 0.2411038 0.0126803 0.1794547 0.0238556 0.2840041 -0.0241247 0.0107748 0.0586484 0.0042897 0.0870464 -0.0273702 0.0683637 -0.0243545 -0.0743588 -0.0016576 0.0896282 -0.1086444 0.0848713 0.0212881 0.0387033 -0.0603967 0.054878 -0.0759777 -0.0691445 -0.1359352 0.0274497 -0.11989 0.0232668 -0.0034587 0.01979 0.0097317 0.0821506 -0.0937827 -0.1187855 -0.1552821 -0.0041714 0.0335814 0.0321065 -0.1125561 0.0097328 -0.0874362 0.0161415 0.0725665 0.0227783 0.0280156 -0.2074879 -0.0556381 0.0402916 -0.0071902 0.0775861 0.1520688 -0.0641748 0.0489162 -0.0788738 0.1847515 -0.0881955 0.0884837 -0.1052701 0.2045736 0.2336767 0.1004788 0.0677735 0.0156583 0.0829395 -0.0301805 0.1478752 0.0907795 0.3503434 0.2841719 0.0031192 0.070977 -0.0023699 0.1873852 -0.0605045 0.1428047 -0.0312181 0.2442215 0.0127727 0.021032 0.0607361 0.0418099 0.0891803 -0.0216043 -0.0488886 -0.0382947 -0.1071878 -0.0617354 -0.0759346 0.0146795 -0.1177715 0.0308738 0.0394646 0.0378448 0.0517131 0.0887081 0.0075657 0.0134495 -0.0250007 0.1224652 -0.0918032 -0.0343563 -0.0502252 -0.0519949 0.0658041 unknown
polarizability: 105.0693227|9.6730598|89.934294|-1.6077026|4.1413792|72.4539415 unknown
InChI: InChI=1S/C6H11N3O2/c1-11-5(10)4-2-3-8-6(7)9-4/h4,9H,2-3,7H2,1H3
charge 0 multiplicity 1
22 atoms
O  2.526643 0.247245 -0.273456
O  1.238345 -1.387048 0.775603
N  -0.981695 -0.713596 -0.915296
N  -2.016939 0.689685 0.770894
N  -3.067198 -1.280599 0.022022
C  0.23674 0.080124 -0.993554
C  -0.107157 1.567958 -0.678423
C  -0.903713 1.658074 0.646794
C  -1.992233 -0.374366 0.001838
C  1.338543 -0.460278 -0.05339
C  3.682469 -0.162151 0.562047
H  0.648239 0.025701 -2.019117
H  -0.728565 1.942357 -1.512838
H  0.81701 2.168305 -0.632624
H  -0.216549 1.51262 1.507746
H  -1.319105 2.677872 0.754718
H  -1.138511 -1.470783 -1.576984
H  -2.869794 -2.278103 -0.059878
H  -3.819178 -1.012588 0.656511
H  3.443503 -0.034536 1.631101
H  4.501551 0.502978 0.255121
H  3.934594 -1.219073 0.372165
