program: Gaussian 09
title: 000206956
version: EM64L-G09RevD.01
frameworkgroup: C1[X(C6H11N3O2)]
method: RPBEPBE
basis: SDD
operation: Freq
keyword: #p
keyword: freq=noraman
keyword: PBEPBE/SDD
title: #p freq=noraman PBEPBE/SDD
converged: YES YES NO NO
title: Mulliken charges:
elementType: O O N N N C C C C C C H H H H H H H H H H H
charge: -0.406753 -0.237410 -0.439865 -0.077212 -0.631455 -0.403018 -0.083878 -0.403603 -0.474681 0.146884 0.122442 0.223793 0.212334 0.283174 0.231432 0.203756 0.219166 0.190426 0.324035 0.320354 0.292766 0.387313
chargesum: 0.00000
title: Mulliken charges with hydrogens summed into heavy atoms:
elementType: O O N N N C C C C C C
charge: -0.019441 -0.237410 -0.115830 -0.077212 -0.018335 0.033109 0.199296 0.031585 -0.065089 0.146884 0.122442
polarizability: 1.03805154e+02 -2.10883529e+00 1.03282675e+02 -1.84177119e+00 7.47364237e+00 6.43336358e+01
1716.lowfreq: -8.2800 -0.0006 -0.0006 -0.0004 7.3007 11.9468 58.8481 98.5604 116.3792
frequency: 58.8384 98.4812 116.3501 164.9168 193.8435 257.5661 288.4989 329.2696 359.5719 388.8218 418.9925 440.5384 488.6681 539.4162 553.0265 579.1064 598.2139 635.4562 675.9071 688.6405 781.3232 828.4271 889.9475 892.4207 935.1446 962.9051 1019.7694 1063.6642 1073.3853 1082.3276 1149.2368 1159.9943 1205.3944 1218.8814 1251.3340 1263.5618 1288.4959 1311.9394 1330.0063 1346.3735 1354.4493 1369.0762 1456.0766 1465.8076 1473.6777 1483.1035 1598.1947 1649.9683 1662.2062 2933.2563 2982.3964 2992.5173 2996.4845 3012.2018 3040.9403 3065.5827 3516.3285 3518.4506 3533.5597 3671.3637
redmass: 9.4250 3.3544 4.6981 4.1992 2.8697 3.5566 2.7778 2.8515 4.8022 3.4469 1.1281 1.8875 1.5547 2.4606 1.4434 1.7899 1.8087 3.4197 5.3065 3.3462 2.8857 2.4337 2.8003 2.9779 2.1967 2.7114 2.1348 2.0278 2.2221 2.1295 1.8851 2.0212 1.9049 1.3285 1.3318 1.3546 1.6670 1.4464 1.2832 1.3320 1.2993 2.1640 1.0799 1.4160 1.3134 1.2520 1.2219 7.2928 5.4275 1.0703 1.0624 1.0807 1.0661 1.0869 1.1017 1.1026 1.0641 1.0459 1.0762 1.1021
irintensity: 0.4789 3.2612 1.0915 5.1371 12.5827 6.8639 4.0473 10.9011 8.5060 6.4943 90.0227 101.9340 43.8649 18.5558 173.9054 117.2045 57.7108 8.9636 35.8054 55.9658 8.4601 18.3897 7.8789 12.3991 14.4662 6.0029 60.3156 98.3439 103.1547 27.5168 2.2204 3.5773 2.1698 15.1993 3.4139 4.4272 17.9528 47.3318 10.7622 10.8044 14.2948 106.0591 11.4117 161.3423 48.0328 50.8963 76.6916 532.6954 68.9532 67.5447 15.6509 13.4520 37.6104 76.5963 13.3839 49.6841 32.7509 21.6766 35.8061 20.7327
temp: 298.150 k
press: 1.00000 atm
elementType: 8 8 7 7 7 6 6 6 6 6 6 1 1 1 1 1 1 1 1 1 1 1
symmnumber: 1
zpe: 470756.2 jmol-1
zpe.correction: 0.179302 hartree
zpe.thermalcorrener: 0.190103 hartree
zpe.thermalcorrenthalpy: 0.191047 hartree
zpe.thermalcorrgfe: 0.143071 hartree
zpe.sumelectzpe: -549.078613 hartree
zpe.sumelectthermal: -549.067811 hartree
zpe.sumelectthermalent: -549.066867 hartree
zpe.sumelectthermalfe: -549.114843 hartree
dipole: -2.2411 -0.0743 -0.1076
dipole: 2.2449
quadrupole: -64.3910 -59.3317 -67.9616
quadrupole: 5.5759 3.9195 -3.1393
quadrupole: -0.4962 4.5631 -4.0669 5.5759 3.9195 -3.1393
hfenergy: -549.2579142 hartree
pointgroup: C01 [X(C6H11N3O2)]
dipole: 0.8818398 -0.0472187 0.0145439 debye
dipolederiv: -0.8576624 0.3778404 -0.3363849 0.3963388 -0.5646075 0.1695353 -0.3211508 0.153196 -0.5492417 -0.7255705 -0.2192788 0.0712737 0.0001576 -0.7790991 0.2687419 -0.0164298 0.3251262 -0.4742738 -1.1969672 0.1097335 0.1393206 0.0531416 -0.589896 -0.1689991 0.2362822 -0.1147303 -0.4092842 -0.6553124 -0.2863036 0.1559761 -0.1063345 -1.0026619 0.0869628 0.1605518 0.2116838 -0.5331686 -0.4424913 0.3995055 -0.026983 0.3771733 -1.1126253 0.1602933 -0.0749583 0.3071179 -0.7191216 -0.050698 -0.0727059 0.0035406 0.1725622 0.0879074 -0.0108135 0.027606 -0.0316899 0.1083898 0.0927353 -0.2531796 0.0280678 -0.5972988 0.2144872 0.064801 0.1433498 0.0434368 0.2617027 0.0540531 0.0539816 0.0678806 -0.0545313 -0.0327362 -0.038695 0.0711396 -0.0443663 0.0110133 0.1947433 0.0021972 0.0122155 0.0630674 0.614127 -0.0221886 0.0307675 -0.0177391 0.293463 1.4389728 -0.0875388 -0.3762236 -0.1294465 1.6105061 -0.2351617 -0.5334673 -0.2554019 0.3659183 1.4493207 0.0718712 0.1932686 -0.1101058 1.0161792 -0.5588734 0.1780013 -0.5959769 0.563173 0.0079393 0.0435708 -0.0544339 0.0925654 -0.0546392 0.0467966 -0.07816 0.0867323 0.002029 -0.018569 0.0110834 0.1038507 -0.036857 0.0603537 0.014069 0.1128795 -0.0355306 -0.0993851 0.0662274 0.0091442 0.0453949 0.0758503 0.035587 0.0252298 -0.0439795 0.0134208 -0.0695444 -0.0065575 0.0140795 -0.0401543 0.0427683 0.0581863 0.1245556 -0.0517239 0.0594218 -0.0721603 0.010207 -0.0116326 -0.0022358 -0.0354925 -0.2106367 -0.0914103 -0.0001118 -0.0840601 0.0731053 -0.1341106 -0.1364941 0.0135045 -0.0959734 -0.0891038 0.0001911 -0.0074773 -0.0639357 0.0726584 0.0465723 0.145071 -0.1165951 0.0185466 -0.0760154 0.0569506 -0.0675566 0.0894723 -0.1370799 0.2237384 -0.0012873 0.0438828 0.0897771 0.1989347 0.0666328 0.0662672 0.0910786 0.2548534 0.1620755 -0.0266795 0.0467057 -0.041434 0.2028297 0.0040852 0.0835413 -0.0418964 0.3418681 0.1352508 -0.0630245 -0.0203144 -0.0467866 0.1443124 -0.0255218 -0.0068923 -0.1700353 0.3648706 0.206103 -0.0799534 0.0484429 -0.1276882 0.2686104 0.0628185 0.0915216 0.0746759 0.3502146 unknown
polarizability: 103.7277894|1.8844046|103.2926904|-3.2102367|-7.2454336|64.4009844 unknown
InChI: InChI=1S/C6H11N3O2/c7-6-8-3-1-2-4(9-6)5(10)11/h4,9-10H,1-3,7H2
charge 0 multiplicity 1
22 atoms
O  3.069965 -0.479191 0.680112
O  2.513441 1.373447 -0.60742
N  -0.180838 0.896775 -0.273905
N  -2.252301 -0.034216 0.633996
N  -2.083752 2.226809 0.036109
C  0.549524 -1.517783 -0.504343
C  0.73129 -0.135365 0.209267
C  -0.954308 -1.826606 -0.711786
C  -1.860825 -1.458938 0.495309
C  -1.519031 0.945688 0.159075
C  2.159408 0.362657 0.040761
H  1.03447 -2.291963 0.118564
H  1.066191 -1.512028 -1.483527
H  0.555508 -0.294165 1.291597
H  -1.325796 -1.2787 -1.598438
H  -1.063551 -2.906589 -0.93279
H  -2.807011 -2.025738 0.403753
H  -1.393191 -1.815741 1.44035
H  0.199483 1.619011 -0.889371
H  -3.07845 2.279231 0.2503
H  -1.510952 3.049895 0.219707
H  3.996328 -0.149188 0.524976
