program: Gaussian 09
title: 000016494
version: EM64L-G09RevD.01
frameworkgroup: C1[X(C7H4Cl4)]
method: RPBEPBE
basis: SDD
operation: Freq
keyword: #pfreq=noraman
keyword: PBEPBE/SDD
title: #p freq=noraman PBEPBE/SDD
converged: YES YES NO NO
title: Mulliken charges:
elementType: Cl Cl Cl Cl C C C C C C C H H H H
charge: -0.002050 0.087103 0.106082 0.105612 0.711194 -0.243120 -0.337193 -0.799910 -0.192046 -0.225821 -0.218898 0.258356 0.264111 0.242436 0.244144
chargesum: 0.00000
title: Mulliken charges with hydrogens summed into heavy atoms:
elementType: Cl Cl Cl Cl C C C C C C C
charge: -0.002050 0.087103 0.106082 0.105612 0.711194 -0.243120 -0.078837 -0.799910 0.072065 0.016615 0.025246
polarizability: 1.28132102e+02 7.66240955e+00 1.30937512e+02 -4.80047379e-04 -9.39759528e-03 7.05462739e+01
1716.lowfreq: -1.0101 -0.0011 0.0024 0.0025 3.7208 6.5290 53.5567 95.0078 146.6576
frequency: 53.5329 95.0060 146.6576 160.1725 194.8866 237.8366 249.1027 263.1538 308.6212 350.0160 387.4035 425.0600 445.6139 521.7352 608.9417 665.8967 672.8813 717.8000 735.3303 778.3210 852.9031 873.9742 958.4043 992.1735 1024.9715 1051.2644 1134.6546 1180.8992 1196.6336 1273.2803 1361.2284 1419.9971 1451.2103 1571.5907 1596.6612 3147.3051 3163.5565 3178.1628 3189.5347
redmass: 14.0155 5.4349 25.8202 9.3191 27.2820 12.6323 10.4926 22.4280 7.1897 12.8428 10.5170 11.1661 3.5564 4.3616 7.7460 6.0987 7.3980 10.6328 2.3727 1.6204 7.3096 1.4269 1.3802 1.3403 7.4920 2.2434 1.7109 1.0906 2.8297 1.4241 9.2433 2.1778 2.3559 6.0692 6.7271 1.0866 1.0918 1.0964 1.0965
irintensity: 0.1794 0.0528 0.0991 0.3883 0.7938 0.0645 1.5309 1.1543 0.1213 0.2305 4.1594 20.4039 0.9056 15.7339 29.8940 159.1660 17.4843 104.7640 112.4358 6.8295 57.7167 2.4335 0.2408 0.0452 44.4392 0.3043 7.0252 7.6139 60.5488 21.3853 4.2863 39.9118 24.0418 13.4758 18.8894 2.7294 7.9116 4.1864 8.1357
temp: 298.150 k
press: 1.00000 atm
elementType: 17 17 17 17 6 6 6 6 6 6 6 1 1 1 1
symmnumber: 1
zpe: 231096.8 jmol-1
zpe.correction: 0.088020 hartree
zpe.thermalcorrener: 0.098645 hartree
zpe.thermalcorrenthalpy: 0.099589 hartree
zpe.thermalcorrgfe: 0.050401 hartree
zpe.sumelectzpe: -2108.571636 hartree
zpe.sumelectthermal: -2108.561011 hartree
zpe.sumelectthermalent: -2108.560067 hartree
zpe.sumelectthermalfe: -2108.609255 hartree
dipole: 3.4401 2.0789 -0.0027
dipole: 4.0195
quadrupole: -82.6285 -86.0285 -94.0090
quadrupole: 2.9327 0.0047 0.0019
quadrupole: 4.9268 1.5268 -6.4537 2.9327 0.0047 0.0019
hfenergy: -2108.6596564 hartree
pointgroup: C01 [X(C7H4Cl4)]
dipole: -1.4979508 -0.5067939 -0.0114896 debye
dipolederiv: -0.1806443 -0.2122562 -0.0001861 -0.2012064 -0.6006961 0.001535 -0.0001634 0.0015001 -0.0227364 -0.2382792 0.20209 -0.0014824 0.1487357 -0.6764981 0.0032968 -0.0013167 0.0038673 -0.1644112 -0.3866946 -0.0687764 0.2171486 -0.1410881 -0.2139078 0.2290951 0.2426971 0.2041035 -0.6043071 -0.3792921 -0.0667106 -0.2126017 -0.1389727 -0.2176584 -0.2349368 -0.2381425 -0.208645 -0.6096319 -0.399034 -0.0519151 -0.0019217 0.0322006 -0.372461 0.0016133 -0.001615 0.0009322 -0.1514935 0.3164718 0.4978571 0.000363 0.1488258 0.9026127 -0.0041295 0.0021434 -0.0013264 -0.0518976 0.0269904 -0.0546084 0.0015884 0.1224921 -0.0202577 0.0004603 0.0007331 -0.0011944 -0.1165596 1.3151295 -0.1559769 -0.0002846 0.0182026 1.1854946 0.0014441 -0.0010611 -0.0001368 1.4419954 -0.2147237 -0.2486405 0.0003087 -0.1461615 -0.179006 -0.0008141 -0.0002771 -0.0015554 -0.091291 -0.1095381 0.1737546 -0.0007208 0.1222896 0.0261992 0.0003204 -0.000463 0.0006891 -0.1325066 0.1365294 -0.0289451 0.0024459 0.0243074 0.113866 -0.0010686 0.0021705 -0.0015262 -0.1298119 0.1203742 0.0448974 -0.0005045 0.0361863 0.0154469 0.0010493 -0.0005511 0.0011443 0.1468373 0.060664 0.0428823 -0.0011104 0.0581043 -0.0050467 0.0014037 -0.0011962 0.0013179 0.161776 0.0278033 -0.0705476 -0.0008325 -0.0870263 -0.044445 0.0003249 -0.0007048 0.000529 0.1654474 -0.0957567 -0.0031044 -0.0022099 0.0031106 0.0863574 0.0004062 -0.0022531 0.0003007 0.1585906 unknown
polarizability: 131.4856126|7.5427685|127.5782969|0.4994206|-0.2390633|70.5519791 unknown
InChI: InChI=1S/C7H4Cl4/c8-6-4-2-1-3-5(6)7(9,10)11/h1-4H
charge 0 multiplicity 1
15 atoms
Cl 0.121699 2.605103 -0.01111
Cl 2.237217 -2.051507 0.030986
Cl 2.28675 0.523462 -1.500651
Cl 2.259045 0.535513 1.543263
C  0.041392 -0.24892 0.004249
C  -0.687789 0.977308 -0.008716
C  -0.721938 -1.448591 0.003617
C  1.557064 -0.300064 0.01773
C  -2.095952 1.000736 -0.021094
C  -2.130551 -1.434949 -0.008841
C  -2.824227 -0.207264 -0.021187
H  -0.195447 -2.405053 0.013533
H  -2.61297 1.964273 -0.03079
H  -2.677952 -2.382446 -0.008674
H  -3.918441 -0.1813 -0.030914
